BDBM268044 4-(1-benzyl-1H-imidazol-5-yl)-2-[(3R)-3-methylmorpholin-4-yl]-8-(1H-pyrazol-5-yl)-1,7-naphthyridine::US9549932, 76
SMILES: C[C@@H]1COCCN1c1cc(-c2cncn2Cc2ccccc2)c2ccnc(-c3ccnn3C3CCCCO3)c2n1
InChI Key: InChIKey=GULNFUNMXPRVKC-DMDVIOLWSA-N
Data: 1 IC50
Activity Spreadsheet -- Enzyme Inhibition Constant Data from BindingDB
Found 1 hit for monomerid = 268044
Trg + Lig
Ki
nM
ΔG°
kcal/mole
IC50
nM
Kd
nM
EC50/IC50
nM
koff
s-1
kon
M-1s-1
pHTemp
°C
Serine/threonine-protein kinase ATR
(Homo sapiens (Human))
BDBM268044
(4-(1-benzyl-1H-imidazol-5-yl)-2-[(3R)-3-methylmorp...)
Show SMILES C[C@@H]1COCCN1c1cc(-c2cncn2Cc2ccccc2)c2ccnc(-c3ccnn3C3CCCCO3)c2n1 |r|
Show InChI InChI=1S/C31H33N7O2/c1-22-20-39-16-14-37(22)28-17-25(27-18-32-21-36(27)19-23-7-3-2-4-8-23)24-10-12-33-31(30(24)35-28)26-11-13-34-38(26)29-9-5-6-15-40-29/h2-4,7-8,10-13,17-18,21-22,29H,5-6,9,14-16,19-20H2,1H3/t22-,29?/m1/s1
Reactome pathway
US Patent
n/an/a 8.91n/an/an/an/a7.0n/a
Bayer Pharma Aktiengesellschaft
US Patent
Assay Description
To determine of binding activity of the test compounds, full-length human ATR protein was expressed and purified together with ATRIP as described abo...
US Patent US9549932 (2017)
BindingDB Entry DOI: 10.7270/Q27S7QSC