BDBM268046 2-[(3R)-3-methylmorpholin-4-yl]-4-(2-methyl-1,3-thiazol-5-yl)-8-(1H-pyrazol-5-yl)-1,7-naphthyridine::US9549932, 78
SMILES: C[C@@H]1COCCN1c1cc(-c2cnc(C)s2)c2ccnc(-c3ccnn3C3CCCCO3)c2n1
InChI Key: InChIKey=YPMXSFANUORYGC-ADRQNKRLSA-N
Data: 1 IC50
Activity Spreadsheet -- Enzyme Inhibition Constant Data from BindingDB
Found 1 hit for monomerid = 268046
Trg + Lig
Ki
nM
ΔG°
kcal/mole
IC50
nM
Kd
nM
EC50/IC50
nM
koff
s-1
kon
M-1s-1
pHTemp
°C
Serine/threonine-protein kinase ATR
(Homo sapiens (Human))
BDBM268046
(2-[(3R)-3-methylmorpholin-4-yl]-4-(2-methyl-1,3-th...)
Show SMILES C[C@@H]1COCCN1c1cc(-c2cnc(C)s2)c2ccnc(-c3ccnn3C3CCCCO3)c2n1 |r|
Show InChI InChI=1S/C25H28N6O2S/c1-16-15-32-12-10-30(16)22-13-19(21-14-27-17(2)34-21)18-6-8-26-25(24(18)29-22)20-7-9-28-31(20)23-5-3-4-11-33-23/h6-9,13-14,16,23H,3-5,10-12,15H2,1-2H3/t16-,23?/m1/s1
Reactome pathway
US Patent
n/an/a 11n/an/an/an/a7.0n/a
Bayer Pharma Aktiengesellschaft
US Patent
Assay Description
To determine of binding activity of the test compounds, full-length human ATR protein was expressed and purified together with ATRIP as described abo...
US Patent US9549932 (2017)
BindingDB Entry DOI: 10.7270/Q27S7QSC