BDBM268051 N-(2,2-dimethylpropyl)-N-methyl-2-[(3R)-3-methylmorpholin-4-yl]-8-(1H-pyrazol-5-yl)-1,7-naphthyridin-4-amine::US9549932, 83
SMILES: C[C@@H]1COCCN1c1cc(N(C)CC(C)(C)C)c2ccnc(-c3ccnn3C3CCCCO3)c2n1
InChI Key: InChIKey=IXMDOYPDZZXWMN-PHSANKKPSA-N
Data: 1 IC50
Activity Spreadsheet -- Enzyme Inhibition Constant Data from BindingDB
Found 1 hit for monomerid = 268051
Trg + Lig
Ki
nM
ΔG°
kcal/mole
IC50
nM
Kd
nM
EC50/IC50
nM
koff
s-1
kon
M-1s-1
pHTemp
°C
Serine/threonine-protein kinase ATR
(Homo sapiens (Human))
BDBM268051
(N-(2,2-dimethylpropyl)-N-methyl-2-[(3R)-3-methylmo...)
Show SMILES C[C@@H]1COCCN1c1cc(N(C)CC(C)(C)C)c2ccnc(-c3ccnn3C3CCCCO3)c2n1 |r|
Show InChI InChI=1S/C27H38N6O2/c1-19-17-34-15-13-32(19)23-16-22(31(5)18-27(2,3)4)20-9-11-28-26(25(20)30-23)21-10-12-29-33(21)24-8-6-7-14-35-24/h9-12,16,19,24H,6-8,13-15,17-18H2,1-5H3/t19-,24?/m1/s1
Reactome pathway
US Patent
n/an/a 5.38n/an/an/an/a7.0n/a
Bayer Pharma Aktiengesellschaft
US Patent
Assay Description
To determine of binding activity of the test compounds, full-length human ATR protein was expressed and purified together with ATRIP as described abo...
US Patent US9549932 (2017)
BindingDB Entry DOI: 10.7270/Q27S7QSC