BDBM268057 4-(2-fluoropyridin-3-yl)-2-[(3R)-3-methylmorpholin-4-yl]-8-(1H-pyrazol-5-yl)-1,7-naphthyridine::US10772893, Example 89::US9549932, 89
SMILES: C[C@@H]1COCCN1c1cc(-c2cccnc2F)c2ccnc(-c3ccn[nH]3)c2n1
InChI Key:
Data: 4 IC50
Activity Spreadsheet -- Enzyme Inhibition Constant Data from BindingDB
Found 4 hits for monomerid = 268057
Trg + Lig
Ki
nM
ΔG°
kcal/mole
IC50
nM
Kd
nM
EC50/IC50
nM
koff
s-1
kon
M-1s-1
pHTemp
°C
Serine/threonine-protein kinase ATR
(Homo sapiens (Human))
BDBM268057
(4-(2-fluoropyridin-3-yl)-2-[(3R)-3-methylmorpholin...)
Show SMILES C[C@@H]1COCCN1c1cc(-c2cccnc2F)c2ccnc(-c3ccn[nH]3)c2n1 |r|
Reactome pathway
US Patent
n/an/a 8.11n/an/an/an/a7.0n/a
Bayer Pharma Aktiengesellschaft
US Patent
Assay Description
To determine of binding activity of the test compounds, full-length human ATR protein was expressed and purified together with ATRIP as described abo...
US Patent US9549932 (2017)
BindingDB Entry DOI: 10.7270/Q27S7QSC
Serine/threonine-protein kinase ATR
(Homo sapiens (Human))
BDBM268057
(4-(2-fluoropyridin-3-yl)-2-[(3R)-3-methylmorpholin...)
Show SMILES C[C@@H]1COCCN1c1cc(-c2cccnc2F)c2ccnc(-c3ccn[nH]3)c2n1 |r|
Reactome pathway
n/an/a 44n/an/an/an/an/an/a
Bayer AG
Curated by ChEMBL
Assay Description
Inhibition of ATR in human HT-29 cells assessed as reduction in histone H2AX phosphorylation measured after 30 mins by immunofluorescence cytometric ...
J Med Chem 63: 7293-7325 (2020)
Serine/threonine-protein kinase ATR
(Homo sapiens (Human))
BDBM268057
(4-(2-fluoropyridin-3-yl)-2-[(3R)-3-methylmorpholin...)
Show SMILES C[C@@H]1COCCN1c1cc(-c2cccnc2F)c2ccnc(-c3ccn[nH]3)c2n1 |r|
Reactome pathway
n/an/a 8n/an/an/an/an/an/a
Bayer AG
Curated by ChEMBL
Assay Description
Inhibition of 5'-TAMRA-labeled tracer 3',6'-bis(dimethylamino)-N-(4-{[2(1H-indol-4-yl)-6-(morpholin-4-yl)-pyrimidin-4-yl]amino}butyl)-3-oxo-3H-spiro[...
J Med Chem 63: 7293-7325 (2020)
ATR/ATRIP
(Homo sapiens (Human))
BDBM268057
(4-(2-fluoropyridin-3-yl)-2-[(3R)-3-methylmorpholin...)
Show SMILES C[C@@H]1COCCN1c1cc(-c2cccnc2F)c2ccnc(-c3ccn[nH]3)c2n1 |r|
US Patent
n/an/a 8.11n/an/an/an/an/an/a
BAYER PHARMA AKTIENGESELLSCHAFT
US Patent
Assay Description
To determine of binding activity of the test compounds, full-length human ATR protein was expressed and purified together with ATRIP as described abo...
US Patent US10772893 (2020)