BDBM268069 2-[(3R)-3-methylmorpholin-4-yl]-4-(4-methyl-3-thienyl)-8-(1H-pyrazol-5-yl)-1,7-naphthyridine::US10772893, Example 101::US9549932, 101
SMILES: C[C@@H]1COCCN1c1cc(-c2cscc2C)c2ccnc(-c3ccn[nH]3)c2n1
InChI Key:
Data: 2 IC50
Activity Spreadsheet -- Enzyme Inhibition Constant Data from BindingDB
Found 2 hits for monomerid = 268069
Trg + Lig
Ki
nM
ΔG°
kcal/mole
IC50
nM
Kd
nM
EC50/IC50
nM
koff
s-1
kon
M-1s-1
pHTemp
°C
ATR/ATRIP
(Homo sapiens (Human))
BDBM268069
(2-[(3R)-3-methylmorpholin-4-yl]-4-(4-methyl-3-thie...)
Show SMILES C[C@@H]1COCCN1c1cc(-c2cscc2C)c2ccnc(-c3ccn[nH]3)c2n1 |r|
US Patent
n/an/a 11.3n/an/an/an/an/an/a
BAYER PHARMA AKTIENGESELLSCHAFT
US Patent
Assay Description
To determine of binding activity of the test compounds, full-length human ATR protein was expressed and purified together with ATRIP as described abo...
US Patent US10772893 (2020)
Serine/threonine-protein kinase ATR
(Homo sapiens (Human))
BDBM268069
(2-[(3R)-3-methylmorpholin-4-yl]-4-(4-methyl-3-thie...)
Show SMILES C[C@@H]1COCCN1c1cc(-c2cscc2C)c2ccnc(-c3ccn[nH]3)c2n1 |r|
Reactome pathway
US Patent
n/an/a 11.3n/an/an/an/a7.0n/a
Bayer Pharma Aktiengesellschaft
US Patent
Assay Description
To determine of binding activity of the test compounds, full-length human ATR protein was expressed and purified together with ATRIP as described abo...
US Patent US9549932 (2017)
BindingDB Entry DOI: 10.7270/Q27S7QSC