BDBM26861 2-aminobenzimidazole with trans-stilbene, 8e::methyl (2E)-3-(5-{[(2E)-5-[benzene(methyl)amido]-1-(2-carbamoylethyl)-2,3-dihydro-1H-1,3-benzodiazol-2-ylidene]carbamoyl}thiophen-2-yl)prop-2-enoate
SMILES: COC(=O)C=Cc1ccc(s1)C(=O)Nc1nc2cc(ccc2n1CCC(N)=O)N(C)C(=O)c1ccccc1
InChI Key: InChIKey=TXZJMLIZASNMPH-UHFFFAOYSA-N
Data: 2 IC50
Activity Spreadsheet -- Enzyme Inhibition Constant Data from BindingDB
Found 2 hits for monomerid = 26861
Trg + Lig
Ki
nM
ΔG°
kcal/mole
IC50
nM
Kd
nM
EC50/IC50
nM
koff
s-1
kon
M-1s-1
pHTemp
°C
Insulin receptor
(Homo sapiens (Human))
BDBM26861
(2-aminobenzimidazole with trans-stilbene, 8e | met...)
Show SMILES COC(=O)C=Cc1ccc(s1)C(=O)Nc1nc2cc(ccc2n1CCC(N)=O)N(C)C(=O)c1ccccc1 |w:5.5|
Show InChI InChI=1S/C27H25N5O5S/c1-31(26(36)17-6-4-3-5-7-17)18-8-11-21-20(16-18)29-27(32(21)15-14-23(28)33)30-25(35)22-12-9-19(38-22)10-13-24(34)37-2/h3-13,16H,14-15H2,1-2H3,(H2,28,33)(H,29,30,35)
n/an/a>5.00E+3n/an/an/an/an/an/a
Boehringer Ingelheim Pharmaceuticals Inc.
Assay Description
Kinase is purified as a GST-fusion protein. The kinase activity is measured using DELFIA which utilizes europium chelate-labeled anti-phosphotyrosine...
Bioorg Med Chem Lett 18: 6218-21 (2008)
Article DOI: 10.1016/j.bmcl.2008.09.098
BindingDB Entry DOI: 10.7270/Q23B5XFW
Tyrosine-protein kinase ITK/TSK
(Homo sapiens (Human))
BDBM26861
(2-aminobenzimidazole with trans-stilbene, 8e | met...)
Show SMILES COC(=O)C=Cc1ccc(s1)C(=O)Nc1nc2cc(ccc2n1CCC(N)=O)N(C)C(=O)c1ccccc1 |w:5.5|
Show InChI InChI=1S/C27H25N5O5S/c1-31(26(36)17-6-4-3-5-7-17)18-8-11-21-20(16-18)29-27(32(21)15-14-23(28)33)30-25(35)22-12-9-19(38-22)10-13-24(34)37-2/h3-13,16H,14-15H2,1-2H3,(H2,28,33)(H,29,30,35)
Reactome pathway
n/an/a 10n/an/an/an/a7.022
Boehringer Ingelheim Pharmaceuticals Inc.
Assay Description
Kinase is purified as a GST-fusion protein. The kinase activity is measured using DELFIA which utilizes europium chelate-labeled anti-phosphotyrosine...
Bioorg Med Chem Lett 18: 6218-21 (2008)
Article DOI: 10.1016/j.bmcl.2008.09.098
BindingDB Entry DOI: 10.7270/Q23B5XFW