BDBM26869 2-aminobenzimidazole with trans-stilbene, 8k::N-[(2E)-5-[benzene(methyl)amido]-1-(2-carbamoylethyl)-2,3-dihydro-1H-1,3-benzodiazol-2-ylidene]-5-[(E)-2-[2-(trifluoromethyl)phenyl]ethenyl]thiophene-2-carboxamide
SMILES: CN(C(=O)c1ccccc1)c1ccc2n(CCC(N)=O)c(NC(=O)c3ccc(\C=C\c4ccccc4C(F)(F)F)s3)nc2c1
InChI Key: InChIKey=NJRJGBUJDGGQDQ-ACCUITESSA-N
Data: 2 IC50
Activity Spreadsheet -- Enzyme Inhibition Constant Data from BindingDB
Found 2 hits for monomerid = 26869
Trg + Lig
Ki
nM
ΔG°
kcal/mole
IC50
nM
Kd
nM
EC50/IC50
nM
koff
s-1
kon
M-1s-1
pHTemp
°C
Insulin receptor
(Homo sapiens (Human))
BDBM26869
(2-aminobenzimidazole with trans-stilbene, 8k | N-[...)
Show SMILES CN(C(=O)c1ccccc1)c1ccc2n(CCC(N)=O)c(NC(=O)c3ccc(\C=C\c4ccccc4C(F)(F)F)s3)nc2c1
Show InChI InChI=1S/C32H26F3N5O3S/c1-39(30(43)21-8-3-2-4-9-21)22-12-15-26-25(19-22)37-31(40(26)18-17-28(36)41)38-29(42)27-16-14-23(44-27)13-11-20-7-5-6-10-24(20)32(33,34)35/h2-16,19H,17-18H2,1H3,(H2,36,41)(H,37,38,42)/b13-11+
n/an/a>5.00E+3n/an/an/an/an/an/a
Boehringer Ingelheim Pharmaceuticals Inc.
Assay Description
Kinase is purified as a GST-fusion protein. The kinase activity is measured using DELFIA which utilizes europium chelate-labeled anti-phosphotyrosine...
Bioorg Med Chem Lett 18: 6218-21 (2008)
Article DOI: 10.1016/j.bmcl.2008.09.098
BindingDB Entry DOI: 10.7270/Q23B5XFW
Tyrosine-protein kinase ITK/TSK
(Homo sapiens (Human))
BDBM26869
(2-aminobenzimidazole with trans-stilbene, 8k | N-[...)
Show SMILES CN(C(=O)c1ccccc1)c1ccc2n(CCC(N)=O)c(NC(=O)c3ccc(\C=C\c4ccccc4C(F)(F)F)s3)nc2c1
Show InChI InChI=1S/C32H26F3N5O3S/c1-39(30(43)21-8-3-2-4-9-21)22-12-15-26-25(19-22)37-31(40(26)18-17-28(36)41)38-29(42)27-16-14-23(44-27)13-11-20-7-5-6-10-24(20)32(33,34)35/h2-16,19H,17-18H2,1H3,(H2,36,41)(H,37,38,42)/b13-11+
Reactome pathway
n/an/a 270n/an/an/an/a7.022
Boehringer Ingelheim Pharmaceuticals Inc.
Assay Description
Kinase is purified as a GST-fusion protein. The kinase activity is measured using DELFIA which utilizes europium chelate-labeled anti-phosphotyrosine...
Bioorg Med Chem Lett 18: 6218-21 (2008)
Article DOI: 10.1016/j.bmcl.2008.09.098
BindingDB Entry DOI: 10.7270/Q23B5XFW