BDBM26877 2-aminobenzimidazole with trans-stilbene, 8t::N-[(2E)-5-[benzene(methyl)amido]-1-(2-carbamoylethyl)-2,3-dihydro-1H-1,3-benzodiazol-2-ylidene]-5-[(E)-2-(pyrazin-2-yl)ethenyl]thiophene-2-carboxamide
SMILES: CN(C(=O)c1ccccc1)c1ccc2n(CCC(N)=O)c(NC(=O)c3ccc(C=Cc4cnccn4)s3)nc2c1
InChI Key: InChIKey=HEGINKBXNHNCBA-UHFFFAOYSA-N
Data: 2 IC50
Activity Spreadsheet -- Enzyme Inhibition Constant Data from BindingDB
Found 2 hits for monomerid = 26877
Trg + Lig
Ki
nM
ΔG°
kcal/mole
IC50
nM
Kd
nM
EC50/IC50
nM
koff
s-1
kon
M-1s-1
pHTemp
°C
Insulin receptor
(Homo sapiens (Human))
BDBM26877
(2-aminobenzimidazole with trans-stilbene, 8t | N-[...)
Show SMILES CN(C(=O)c1ccccc1)c1ccc2n(CCC(N)=O)c(NC(=O)c3ccc(C=Cc4cnccn4)s3)nc2c1 |w:28.28|
Show InChI InChI=1S/C29H25N7O3S/c1-35(28(39)19-5-3-2-4-6-19)21-8-11-24-23(17-21)33-29(36(24)16-13-26(30)37)34-27(38)25-12-10-22(40-25)9-7-20-18-31-14-15-32-20/h2-12,14-15,17-18H,13,16H2,1H3,(H2,30,37)(H,33,34,38)
n/an/a>5.00E+3n/an/an/an/an/an/a
Boehringer Ingelheim Pharmaceuticals Inc.
Assay Description
Kinase is purified as a GST-fusion protein. The kinase activity is measured using DELFIA which utilizes europium chelate-labeled anti-phosphotyrosine...
Bioorg Med Chem Lett 18: 6218-21 (2008)
Article DOI: 10.1016/j.bmcl.2008.09.098
BindingDB Entry DOI: 10.7270/Q23B5XFW
Tyrosine-protein kinase ITK/TSK
(Homo sapiens (Human))
BDBM26877
(2-aminobenzimidazole with trans-stilbene, 8t | N-[...)
Show SMILES CN(C(=O)c1ccccc1)c1ccc2n(CCC(N)=O)c(NC(=O)c3ccc(C=Cc4cnccn4)s3)nc2c1 |w:28.28|
Show InChI InChI=1S/C29H25N7O3S/c1-35(28(39)19-5-3-2-4-6-19)21-8-11-24-23(17-21)33-29(36(24)16-13-26(30)37)34-27(38)25-12-10-22(40-25)9-7-20-18-31-14-15-32-20/h2-12,14-15,17-18H,13,16H2,1H3,(H2,30,37)(H,33,34,38)
Reactome pathway
n/an/a 8n/an/an/an/a7.022
Boehringer Ingelheim Pharmaceuticals Inc.
Assay Description
Kinase is purified as a GST-fusion protein. The kinase activity is measured using DELFIA which utilizes europium chelate-labeled anti-phosphotyrosine...
Bioorg Med Chem Lett 18: 6218-21 (2008)
Article DOI: 10.1016/j.bmcl.2008.09.098
BindingDB Entry DOI: 10.7270/Q23B5XFW