BDBM26911 8-[bis(2-chlorophenyl)methyl]-3-[2-(cyclopropylamino)ethyl]-1-phenyl-1,3,8-triazaspiro[4.5]decan-4-one::spiropiperidine analogue, 32
SMILES: Clc1ccccc1C(N1CCC2(CC1)N(CN(CCNC1CC1)C2=O)c1ccccc1)c1ccccc1Cl
InChI Key: InChIKey=PHEIVMXYEVVNHK-UHFFFAOYSA-N
Data: 4 KI
Activity Spreadsheet -- Enzyme Inhibition Constant Data from BindingDB
Found 4 hits for monomerid = 26911
Trg + Lig
Ki
nM
ΔG°
kcal/mole
IC50
nM
Kd
nM
EC50/IC50
nM
koff
s-1
kon
M-1s-1
pHTemp
°C
Nociceptin receptor
(Homo sapiens (Human))
BDBM26911
(8-[bis(2-chlorophenyl)methyl]-3-[2-(cyclopropylami...)
Show SMILES Clc1ccccc1C(N1CCC2(CC1)N(CN(CCNC1CC1)C2=O)c1ccccc1)c1ccccc1Cl
Show InChI InChI=1S/C31H34Cl2N4O/c32-27-12-6-4-10-25(27)29(26-11-5-7-13-28(26)33)35-19-16-31(17-20-35)30(38)36(21-18-34-23-14-15-23)22-37(31)24-8-2-1-3-9-24/h1-13,23,29,34H,14-22H2
Reactome pathway
3.70 -11.4n/an/an/an/an/a7.422
Schering-Plough Research Institute
Assay Description
IC50 values were obtained by fitting the competition binding curves according to a 4-parameter logistic model. Inhibition constants Ki were derived f...
Bioorg Med Chem Lett 19: 1164-7 (2009)
Article DOI: 10.1016/j.bmcl.2008.12.092
BindingDB Entry DOI: 10.7270/Q2TT4P95
Mu-type opioid receptor
(Homo sapiens (Human))
BDBM26911
(8-[bis(2-chlorophenyl)methyl]-3-[2-(cyclopropylami...)
Show SMILES Clc1ccccc1C(N1CCC2(CC1)N(CN(CCNC1CC1)C2=O)c1ccccc1)c1ccccc1Cl
Show InChI InChI=1S/C31H34Cl2N4O/c32-27-12-6-4-10-25(27)29(26-11-5-7-13-28(26)33)35-19-16-31(17-20-35)30(38)36(21-18-34-23-14-15-23)22-37(31)24-8-2-1-3-9-24/h1-13,23,29,34H,14-22H2
NCI pathway
Reactome pathway
978n/an/an/an/an/an/an/an/a
Schering-Plough Research Institute
Assay Description
IC50 values were obtained by fitting the competition binding curves according to a 4-parameter logistic model. Inhibition constants Ki were derived f...
Bioorg Med Chem Lett 19: 1164-7 (2009)
Article DOI: 10.1016/j.bmcl.2008.12.092
BindingDB Entry DOI: 10.7270/Q2TT4P95
Kappa-type opioid receptor
(Homo sapiens (Human))
BDBM26911
(8-[bis(2-chlorophenyl)methyl]-3-[2-(cyclopropylami...)
Show SMILES Clc1ccccc1C(N1CCC2(CC1)N(CN(CCNC1CC1)C2=O)c1ccccc1)c1ccccc1Cl
Show InChI InChI=1S/C31H34Cl2N4O/c32-27-12-6-4-10-25(27)29(26-11-5-7-13-28(26)33)35-19-16-31(17-20-35)30(38)36(21-18-34-23-14-15-23)22-37(31)24-8-2-1-3-9-24/h1-13,23,29,34H,14-22H2
Reactome pathway
1.01E+3n/an/an/an/an/an/an/an/a
Schering-Plough Research Institute
Assay Description
IC50 values were obtained by fitting the competition binding curves according to a 4-parameter logistic model. Inhibition constants Ki were derived f...
Bioorg Med Chem Lett 19: 1164-7 (2009)
Article DOI: 10.1016/j.bmcl.2008.12.092
BindingDB Entry DOI: 10.7270/Q2TT4P95
Delta-type opioid receptor
(Homo sapiens (Human))
BDBM26911
(8-[bis(2-chlorophenyl)methyl]-3-[2-(cyclopropylami...)
Show SMILES Clc1ccccc1C(N1CCC2(CC1)N(CN(CCNC1CC1)C2=O)c1ccccc1)c1ccccc1Cl
Show InChI InChI=1S/C31H34Cl2N4O/c32-27-12-6-4-10-25(27)29(26-11-5-7-13-28(26)33)35-19-16-31(17-20-35)30(38)36(21-18-34-23-14-15-23)22-37(31)24-8-2-1-3-9-24/h1-13,23,29,34H,14-22H2
Reactome pathway
1.14E+3n/an/an/an/an/an/an/an/a
Schering-Plough Research Institute
Assay Description
IC50 values were obtained by fitting the competition binding curves according to a 4-parameter logistic model. Inhibition constants Ki were derived f...
Bioorg Med Chem Lett 19: 1164-7 (2009)
Article DOI: 10.1016/j.bmcl.2008.12.092
BindingDB Entry DOI: 10.7270/Q2TT4P95