null
SMILES: Oc1ccc(cc1)-c1sc2cc(O)ccc2c1Oc1ccc(\C=C\C(=O)NCCC(F)(F)F)cc1
InChI Key: InChIKey=YYSWXOGEMBMHTL-KGVSQERTSA-N
Activity Spreadsheet -- Enzyme Inhibition Constant Data from BindingDB
Found 4 hits for monomerid = 269377
Trg + Lig
Ki
nM
ΔG°
kcal/mole
IC50
nM
Kd
nM
EC50/IC50
nM
koff
s-1
kon
M-1s-1
pHTemp
°C
Estrogen receptor
(Homo sapiens (Human))
BDBM269377
(US10058534, 31)
Show SMILES Oc1ccc(cc1)-c1sc2cc(O)ccc2c1Oc1ccc(\C=C\C(=O)NCCC(F)(F)F)cc1
Show InChI InChI=1S/C26H20F3NO4S/c27-26(28,29)13-14-30-23(33)12-3-16-1-9-20(10-2-16)34-24-21-11-8-19(32)15-22(21)35-25(24)17-4-6-18(31)7-5-17/h1-12,15,31-32H,13-14H2,(H,30,33)/b12-3+
US Patent
n/an/a 10n/an/an/an/a5.137
Novartis AG
US Patent
Assay Description
The ER transcription assay is a reporter assay that is based on the ability of ER to induce transcription from a luciferase reporter gene containing ...
US Patent US10058534 (2018)
BindingDB Entry DOI: 10.7270/Q2M32XSG
Estrogen receptor
(Homo sapiens (Human))
BDBM269377
(US10058534, 31)
Show SMILES Oc1ccc(cc1)-c1sc2cc(O)ccc2c1Oc1ccc(\C=C\C(=O)NCCC(F)(F)F)cc1
Show InChI InChI=1S/C26H20F3NO4S/c27-26(28,29)13-14-30-23(33)12-3-16-1-9-20(10-2-16)34-24-21-11-8-19(32)15-22(21)35-25(24)17-4-6-18(31)7-5-17/h1-12,15,31-32H,13-14H2,(H,30,33)/b12-3+
n/an/a 1n/an/an/an/an/an/a
Novartis Institutes for BioMedical Research
Curated by ChEMBL
Assay Description
Induction of selective estrogen receptor alpha degradation in human MCF7 cells after 18 to 24 hrs by in-cell Western analysis
J Med Chem 61: 2837-2864 (2018)
Article DOI: 10.1021/acs.jmedchem.7b01682
BindingDB Entry DOI: 10.7270/Q2TB1986
Estrogen receptor
(Homo sapiens (Human))
BDBM269377
(US10058534, 31)
Show SMILES Oc1ccc(cc1)-c1sc2cc(O)ccc2c1Oc1ccc(\C=C\C(=O)NCCC(F)(F)F)cc1
Show InChI InChI=1S/C26H20F3NO4S/c27-26(28,29)13-14-30-23(33)12-3-16-1-9-20(10-2-16)34-24-21-11-8-19(32)15-22(21)35-25(24)17-4-6-18(31)7-5-17/h1-12,15,31-32H,13-14H2,(H,30,33)/b12-3+
n/an/a 10n/an/an/an/an/an/a
Novartis Institutes for BioMedical Research
Curated by ChEMBL
Assay Description
Induction of selective estrogen receptor alpha degradation in human MCF7 cells harboring TK-ERE-Luc assessed as reduction in estradiol-induced transc...
J Med Chem 61: 2837-2864 (2018)
Article DOI: 10.1021/acs.jmedchem.7b01682
BindingDB Entry DOI: 10.7270/Q2TB1986
Estrogen receptor
(Homo sapiens (Human))
BDBM269377
(US10058534, 31)
Show SMILES Oc1ccc(cc1)-c1sc2cc(O)ccc2c1Oc1ccc(\C=C\C(=O)NCCC(F)(F)F)cc1
Show InChI InChI=1S/C26H20F3NO4S/c27-26(28,29)13-14-30-23(33)12-3-16-1-9-20(10-2-16)34-24-21-11-8-19(32)15-22(21)35-25(24)17-4-6-18(31)7-5-17/h1-12,15,31-32H,13-14H2,(H,30,33)/b12-3+
US Patent
n/an/a 1n/an/an/an/a7.425
Novartis AG
US Patent
Assay Description
Plate MCF7 cells at 0.3 million cells/mL (100 l/well) in black, clear-bottom 96-well plates (Greiner, catalog number 655090) in DMEM/F12 media (Gibco...
US Patent US10058534 (2018)
BindingDB Entry DOI: 10.7270/Q2M32XSG