null
SMILES: Cn1nnnc1\C=C\c1ccc(Oc2c(sc3cc(O)ccc23)-c2ccc(O)cc2)cc1
InChI Key: InChIKey=YUUWIHXRIQHLBM-YIXHJXPBSA-N
Activity Spreadsheet -- Enzyme Inhibition Constant Data from BindingDB
Found 4 hits for monomerid = 269399
Trg + Lig
Ki
nM
ΔG°
kcal/mole
IC50
nM
Kd
nM
EC50/IC50
nM
koff
s-1
kon
M-1s-1
pHTemp
°C
Estrogen receptor
(Homo sapiens (Human))
BDBM269399
(US10058534, 54)
Show SMILES Cn1nnnc1\C=C\c1ccc(Oc2c(sc3cc(O)ccc23)-c2ccc(O)cc2)cc1
Show InChI InChI=1S/C24H18N4O3S/c1-28-22(25-26-27-28)13-4-15-2-10-19(11-3-15)31-23-20-12-9-18(30)14-21(20)32-24(23)16-5-7-17(29)8-6-16/h2-14,29-30H,1H3/b13-4+
US Patent
n/an/a 1n/an/an/an/a5.137
Novartis AG
US Patent
Assay Description
The ER transcription assay is a reporter assay that is based on the ability of ER to induce transcription from a luciferase reporter gene containing ...
US Patent US10058534 (2018)
BindingDB Entry DOI: 10.7270/Q2M32XSG
Estrogen receptor
(Homo sapiens (Human))
BDBM269399
(US10058534, 54)
Show SMILES Cn1nnnc1\C=C\c1ccc(Oc2c(sc3cc(O)ccc23)-c2ccc(O)cc2)cc1
Show InChI InChI=1S/C24H18N4O3S/c1-28-22(25-26-27-28)13-4-15-2-10-19(11-3-15)31-23-20-12-9-18(30)14-21(20)32-24(23)16-5-7-17(29)8-6-16/h2-14,29-30H,1H3/b13-4+
n/an/a 60n/an/an/an/an/an/a
Novartis Institutes for BioMedical Research
Curated by ChEMBL
Assay Description
Induction of selective estrogen receptor alpha degradation in human MCF7 cells after 18 to 24 hrs by in-cell Western analysis
J Med Chem 61: 2837-2864 (2018)
Article DOI: 10.1021/acs.jmedchem.7b01682
BindingDB Entry DOI: 10.7270/Q2TB1986
Estrogen receptor
(Homo sapiens (Human))
BDBM269399
(US10058534, 54)
Show SMILES Cn1nnnc1\C=C\c1ccc(Oc2c(sc3cc(O)ccc23)-c2ccc(O)cc2)cc1
Show InChI InChI=1S/C24H18N4O3S/c1-28-22(25-26-27-28)13-4-15-2-10-19(11-3-15)31-23-20-12-9-18(30)14-21(20)32-24(23)16-5-7-17(29)8-6-16/h2-14,29-30H,1H3/b13-4+
n/an/a 1n/an/an/an/an/an/a
Novartis Institutes for BioMedical Research
Curated by ChEMBL
Assay Description
Induction of selective estrogen receptor alpha degradation in human MCF7 cells harboring TK-ERE-Luc assessed as reduction in estradiol-induced transc...
J Med Chem 61: 2837-2864 (2018)
Article DOI: 10.1021/acs.jmedchem.7b01682
BindingDB Entry DOI: 10.7270/Q2TB1986
Estrogen receptor
(Homo sapiens (Human))
BDBM269399
(US10058534, 54)
Show SMILES Cn1nnnc1\C=C\c1ccc(Oc2c(sc3cc(O)ccc23)-c2ccc(O)cc2)cc1
Show InChI InChI=1S/C24H18N4O3S/c1-28-22(25-26-27-28)13-4-15-2-10-19(11-3-15)31-23-20-12-9-18(30)14-21(20)32-24(23)16-5-7-17(29)8-6-16/h2-14,29-30H,1H3/b13-4+
US Patent
n/an/a 60n/an/an/an/a7.425
Novartis AG
US Patent
Assay Description
Plate MCF7 cells at 0.3 million cells/mL (100 l/well) in black, clear-bottom 96-well plates (Greiner, catalog number 655090) in DMEM/F12 media (Gibco...
US Patent US10058534 (2018)
BindingDB Entry DOI: 10.7270/Q2M32XSG