BDBM269431 (E)-3-(4-((2-(2-(sec- butyl)phenyl)-6- hydroxybenzo[b] thiophen-3- yl)oxy)phenyl)acrylic acid::US10058534, 86
SMILES: CCC(C)c1ccccc1-c1sc2cc(O)ccc2c1Oc1ccc(\C=C\C(O)=O)cc1
InChI Key: InChIKey=VBYIDNBKZZBXCS-XNTDXEJSSA-N
Data: 2 IC50
Activity Spreadsheet -- Enzyme Inhibition Constant Data from BindingDB
Found 2 hits for monomerid = 269431
Trg + Lig
Ki
nM
ΔG°
kcal/mole
IC50
nM
Kd
nM
EC50/IC50
nM
koff
s-1
kon
M-1s-1
pHTemp
°C
Estrogen receptor
(Homo sapiens (Human))
BDBM269431
((E)-3-(4-((2-(2-(sec- butyl)phenyl)-6- hydroxybenz...)
Show SMILES CCC(C)c1ccccc1-c1sc2cc(O)ccc2c1Oc1ccc(\C=C\C(O)=O)cc1
Show InChI InChI=1S/C27H24O4S/c1-3-17(2)21-6-4-5-7-22(21)27-26(23-14-11-19(28)16-24(23)32-27)31-20-12-8-18(9-13-20)10-15-25(29)30/h4-17,28H,3H2,1-2H3,(H,29,30)/b15-10+
US Patent
n/an/a 0.200n/an/an/an/a7.425
Novartis AG
US Patent
Assay Description
Plate MCF7 cells at 0.3 million cells/mL (100 l/well) in black, clear-bottom 96-well plates (Greiner, catalog number 655090) in DMEM/F12 media (Gibco...
US Patent US10058534 (2018)
BindingDB Entry DOI: 10.7270/Q2M32XSG
Estrogen receptor
(Homo sapiens (Human))
BDBM269431
((E)-3-(4-((2-(2-(sec- butyl)phenyl)-6- hydroxybenz...)
Show SMILES CCC(C)c1ccccc1-c1sc2cc(O)ccc2c1Oc1ccc(\C=C\C(O)=O)cc1
Show InChI InChI=1S/C27H24O4S/c1-3-17(2)21-6-4-5-7-22(21)27-26(23-14-11-19(28)16-24(23)32-27)31-20-12-8-18(9-13-20)10-15-25(29)30/h4-17,28H,3H2,1-2H3,(H,29,30)/b15-10+
US Patent
n/an/a 7n/an/an/an/a5.137
Novartis AG
US Patent
Assay Description
The ER transcription assay is a reporter assay that is based on the ability of ER to induce transcription from a luciferase reporter gene containing ...
US Patent US10058534 (2018)
BindingDB Entry DOI: 10.7270/Q2M32XSG