BDBM269438 3-(4-((6-hydroxy-2-(2- isopropylphenyl)benzo [b]thiophen-3- yl)oxy)phenyl)propanoic acid::US10058534, 93
SMILES: CC(C)c1ccccc1-c1sc2cc(O)ccc2c1Oc1ccc(CCC(O)=O)cc1
InChI Key: InChIKey=MKRCBSNFPAOKKD-UHFFFAOYSA-N
Data: 2 IC50
Activity Spreadsheet -- Enzyme Inhibition Constant Data from BindingDB
Found 2 hits for monomerid = 269438
Trg + Lig
Ki
nM
ΔG°
kcal/mole
IC50
nM
Kd
nM
EC50/IC50
nM
koff
s-1
kon
M-1s-1
pHTemp
°C
Estrogen receptor
(Homo sapiens (Human))
BDBM269438
(3-(4-((6-hydroxy-2-(2- isopropylphenyl)benzo [b]th...)
Show SMILES CC(C)c1ccccc1-c1sc2cc(O)ccc2c1Oc1ccc(CCC(O)=O)cc1
Show InChI InChI=1S/C26H24O4S/c1-16(2)20-5-3-4-6-21(20)26-25(22-13-10-18(27)15-23(22)31-26)30-19-11-7-17(8-12-19)9-14-24(28)29/h3-8,10-13,15-16,27H,9,14H2,1-2H3,(H,28,29)
US Patent
n/an/a 1.60n/an/an/an/a7.425
Novartis AG
US Patent
Assay Description
Plate MCF7 cells at 0.3 million cells/mL (100 l/well) in black, clear-bottom 96-well plates (Greiner, catalog number 655090) in DMEM/F12 media (Gibco...
US Patent US10058534 (2018)
BindingDB Entry DOI: 10.7270/Q2M32XSG
Estrogen receptor
(Homo sapiens (Human))
BDBM269438
(3-(4-((6-hydroxy-2-(2- isopropylphenyl)benzo [b]th...)
Show SMILES CC(C)c1ccccc1-c1sc2cc(O)ccc2c1Oc1ccc(CCC(O)=O)cc1
Show InChI InChI=1S/C26H24O4S/c1-16(2)20-5-3-4-6-21(20)26-25(22-13-10-18(27)15-23(22)31-26)30-19-11-7-17(8-12-19)9-14-24(28)29/h3-8,10-13,15-16,27H,9,14H2,1-2H3,(H,28,29)
US Patent
n/an/a 72n/an/an/an/a5.137
Novartis AG
US Patent
Assay Description
The ER transcription assay is a reporter assay that is based on the ability of ER to induce transcription from a luciferase reporter gene containing ...
US Patent US10058534 (2018)
BindingDB Entry DOI: 10.7270/Q2M32XSG