BDBM269468 (E)-3-(4-((6-hydroxy-2- (2-(oxetan-3- yl)phenyl)benzo[b] thiophen-3- yl)oxy)phenyl)acrylic acid::US10058534, 123
SMILES: OC(=O)\C=C\c1ccc(Oc2c(sc3cc(O)ccc23)-c2ccccc2C2COC2)cc1
InChI Key: InChIKey=YUBDDBHWDRWIHA-KPKJPENVSA-N
Data: 2 IC50
Activity Spreadsheet -- Enzyme Inhibition Constant Data from BindingDB
Found 2 hits for monomerid = 269468
Trg + Lig
Ki
nM
ΔG°
kcal/mole
IC50
nM
Kd
nM
EC50/IC50
nM
koff
s-1
kon
M-1s-1
pHTemp
°C
Estrogen receptor
(Homo sapiens (Human))
BDBM269468
((E)-3-(4-((6-hydroxy-2- (2-(oxetan-3- yl)phenyl)be...)
Show SMILES OC(=O)\C=C\c1ccc(Oc2c(sc3cc(O)ccc23)-c2ccccc2C2COC2)cc1
Show InChI InChI=1S/C26H20O5S/c27-18-8-11-22-23(13-18)32-26(21-4-2-1-3-20(21)17-14-30-15-17)25(22)31-19-9-5-16(6-10-19)7-12-24(28)29/h1-13,17,27H,14-15H2,(H,28,29)/b12-7+
US Patent
n/an/a 1.10n/an/an/an/a7.425
Novartis AG
US Patent
Assay Description
Plate MCF7 cells at 0.3 million cells/mL (100 l/well) in black, clear-bottom 96-well plates (Greiner, catalog number 655090) in DMEM/F12 media (Gibco...
US Patent US10058534 (2018)
BindingDB Entry DOI: 10.7270/Q2M32XSG
Estrogen receptor
(Homo sapiens (Human))
BDBM269468
((E)-3-(4-((6-hydroxy-2- (2-(oxetan-3- yl)phenyl)be...)
Show SMILES OC(=O)\C=C\c1ccc(Oc2c(sc3cc(O)ccc23)-c2ccccc2C2COC2)cc1
Show InChI InChI=1S/C26H20O5S/c27-18-8-11-22-23(13-18)32-26(21-4-2-1-3-20(21)17-14-30-15-17)25(22)31-19-9-5-16(6-10-19)7-12-24(28)29/h1-13,17,27H,14-15H2,(H,28,29)/b12-7+
US Patent
n/an/a 83n/an/an/an/a5.137
Novartis AG
US Patent
Assay Description
The ER transcription assay is a reporter assay that is based on the ability of ER to induce transcription from a luciferase reporter gene containing ...
US Patent US10058534 (2018)
BindingDB Entry DOI: 10.7270/Q2M32XSG