BDBM2696 3-{1H,2H,3H-benzo[b]pyrrolizin-9-yl}-4-(1-methyl-1H-indol-3-yl)-2,5-dihydro-1H-pyrrole-2,5-dione::Bisindolylmaleimide deriv. 5a
SMILES: Cn1cc(C2=C(C(=O)NC2=O)c2c3CCCn3c3ccccc23)c2ccccc12
InChI Key: InChIKey=QJISCZMEOOQPLS-UHFFFAOYSA-N
Data: 2 IC50
Activity Spreadsheet -- Enzyme Inhibition Constant Data from BindingDB
Found 2 hits for monomerid = 2696
Trg + Lig
Ki
nM
ΔG°
kcal/mole
IC50
nM
Kd
nM
EC50/IC50
nM
koff
s-1
kon
M-1s-1
pHTemp
°C
cAMP-Dependent Protein Kinase (PKA)
(Bos taurus (bovine))
BDBM2696
(3-{1H,2H,3H-benzo[b]pyrrolizin-9-yl}-4-(1-methyl-1...)
Show SMILES Cn1cc(C2=C(C(=O)NC2=O)c2c3CCCn3c3ccccc23)c2ccccc12 |t:4|
Show InChI InChI=1S/C24H19N3O2/c1-26-13-16(14-7-2-4-9-17(14)26)21-22(24(29)25-23(21)28)20-15-8-3-5-10-18(15)27-12-6-11-19(20)27/h2-5,7-10,13H,6,11-12H2,1H3,(H,25,28,29)
n/an/a 6.80E+4n/an/an/an/a8.537
Roche Products Limited
Assay Description
The activity of PKA, activated by cAMP, is measured by its ability to transfer phosphate from [gamma-32P]ATP to histone.
J Med Chem 36: 21-9 (1993)
Article DOI: 10.1021/jm00053a003
BindingDB Entry DOI: 10.7270/Q29P2ZTD
Protein Kinase C
(Rattus norvegicus (rat))
BDBM2696
(3-{1H,2H,3H-benzo[b]pyrrolizin-9-yl}-4-(1-methyl-1...)
Show SMILES Cn1cc(C2=C(C(=O)NC2=O)c2c3CCCn3c3ccccc23)c2ccccc12 |t:4|
Show InChI InChI=1S/C24H19N3O2/c1-26-13-16(14-7-2-4-9-17(14)26)21-22(24(29)25-23(21)28)20-15-8-3-5-10-18(15)27-12-6-11-19(20)27/h2-5,7-10,13H,6,11-12H2,1H3,(H,25,28,29)
n/an/a 210n/an/an/an/a7.530
Roche Products Limited
Assay Description
The activity of PKC, activated by phosphatidylerine and Ca2+, is measured by its ability to transfer phosphate from [gamma-32P]ATP to lysine-rich his...
J Med Chem 36: 21-9 (1993)
Article DOI: 10.1021/jm00053a003
BindingDB Entry DOI: 10.7270/Q29P2ZTD