BDBM27018 2-[(3S,13S,16S,17R,19S)-3-({[(2S)-3,3-dimethyl-1-[methyl(thiophene-2-)sulfonamido]butan-2-yl]carbamoyl}amino)-18,18-dimethyl-2,15-dioxo-1,14-diazatricyclo[14.4.0.0^{17,19}]icosan-13-yl]-2-oxo-N-propylacetamide::ketoamide derived macrocyclic inhibitor, 42
SMILES: CCCNC(=O)C(=O)[C@@H]1CCCCCCCCC[C@H](NC(=O)N[C@H](CN(C)S(=O)(=O)c2cccs2)C(C)(C)C)C(=O)N2C[C@H]3[C@@H]([C@H]2C(=O)N1)C3(C)C
InChI Key: InChIKey=UOIIYJQZEQJBMJ-YSWXZNAESA-N
Data: 1 KI
Activity Spreadsheet -- Enzyme Inhibition Constant Data from BindingDB
Found 1 hit for monomerid = 27018
Trg + Lig
Ki
nM
ΔG°
kcal/mole
IC50
nM
Kd
nM
EC50/IC50
nM
koff
s-1
kon
M-1s-1
pHTemp
°C
HCV NS3-NS4A Serine Proteinase
(Hepatitis C virus (HCV genotype 1a, isolate H))
BDBM27018
(2-[(3S,13S,16S,17R,19S)-3-({[(2S)-3,3-dimethyl-1-[...)
Show SMILES CCCNC(=O)C(=O)[C@@H]1CCCCCCCCC[C@H](NC(=O)N[C@H](CN(C)S(=O)(=O)c2cccs2)C(C)(C)C)C(=O)N2C[C@H]3[C@@H]([C@H]2C(=O)N1)C3(C)C |r|
Show InChI InChI=1S/C37H60N6O7S2/c1-8-20-38-33(46)31(44)25-17-14-12-10-9-11-13-15-18-26(34(47)43-22-24-29(37(24,5)6)30(43)32(45)39-25)40-35(48)41-27(36(2,3)4)23-42(7)52(49,50)28-19-16-21-51-28/h16,19,21,24-27,29-30H,8-15,17-18,20,22-23H2,1-7H3,(H,38,46)(H,39,45)(H2,40,41,48)/t24-,25-,26-,27+,29-,30-/m0/s1
14 -10.9n/an/an/an/an/a6.530
Schering-Plough Research Institute
Assay Description
Proteolytic cleavage of the ester linkage between the Nva (L-norvaline) and the chromophore (PAP) was monitored for change in absorbance at 370 nm. I...
J Med Chem 52: 336-46 (2009)
Article DOI: 10.1021/jm800940u
BindingDB Entry DOI: 10.7270/Q2639N17