BDBM270496 3-[({(1S)-6-[2-methyl-4-(2,2,2-trifluoroethoxy)phenyl]-1,2,3,4-tetrahydroisoquinolyl}methyl)amino]pyridine-4-carboxylic acid::US10059687, Example 2A
SMILES: Cc1cc(OCC(F)(F)F)ccc1-c1ccc2[C@@H](CNc3cnccc3C(O)=O)NCCc2c1
InChI Key: InChIKey=JBILETKNMYCYMF-HSZRJFAPSA-N
Data: 9 IC50
Activity Spreadsheet -- Enzyme Inhibition Constant Data from BindingDB
Found 9 hits for monomerid = 270496
Trg + Lig
Ki
nM
ΔG°
kcal/mole
IC50
nM
Kd
nM
EC50/IC50
nM
koff
s-1
kon
M-1s-1
pHTemp
°C
Lysine-specific demethylase 4C
(Homo sapiens (Human))
BDBM270496
(3-[({(1S)-6-[2-methyl-4-(2,2,2-trifluoroethoxy)phe...)
Show SMILES Cc1cc(OCC(F)(F)F)ccc1-c1ccc2[C@@H](CNc3cnccc3C(O)=O)NCCc2c1 |r|
Show InChI InChI=1S/C25H24F3N3O3/c1-15-10-18(34-14-25(26,27)28)3-5-19(15)16-2-4-20-17(11-16)6-9-30-23(20)13-31-22-12-29-8-7-21(22)24(32)33/h2-5,7-8,10-12,23,30-31H,6,9,13-14H2,1H3,(H,32,33)/t23-/m1/s1
US Patent
n/an/a 5.50E+3n/an/an/an/an/an/a
Celgene Quanticel Research, Inc.
US Patent
Assay Description
The ability of test compounds to inhibit the activity of JMJD2C was determined in 384-well plate format under the following reaction conditions: 0.3 ...
US Patent US10059687 (2018)
BindingDB Entry DOI: 10.7270/Q2TM7D54
Lysine-specific demethylase 6B
(Homo sapiens (Human))
BDBM270496
(3-[({(1S)-6-[2-methyl-4-(2,2,2-trifluoroethoxy)phe...)
Show SMILES Cc1cc(OCC(F)(F)F)ccc1-c1ccc2[C@@H](CNc3cnccc3C(O)=O)NCCc2c1 |r|
Show InChI InChI=1S/C25H24F3N3O3/c1-15-10-18(34-14-25(26,27)28)3-5-19(15)16-2-4-20-17(11-16)6-9-30-23(20)13-31-22-12-29-8-7-21(22)24(32)33/h2-5,7-8,10-12,23,30-31H,6,9,13-14H2,1H3,(H,32,33)/t23-/m1/s1
US Patent
n/an/a 5.50E+3n/an/an/an/an/an/a
Celgene Quanticel Research, Inc.
US Patent
Assay Description
The enzymatic assay of JMJD3 activity is based upon Time Resolved-Fluorescence Resonance Energy Transfer (TR-FRET) detection. The ability of test com...
US Patent US10059687 (2018)
BindingDB Entry DOI: 10.7270/Q2TM7D54
Lysine-specific demethylase 5B
(Homo sapiens (Human))
BDBM270496
(3-[({(1S)-6-[2-methyl-4-(2,2,2-trifluoroethoxy)phe...)
Show SMILES Cc1cc(OCC(F)(F)F)ccc1-c1ccc2[C@@H](CNc3cnccc3C(O)=O)NCCc2c1 |r|
Show InChI InChI=1S/C25H24F3N3O3/c1-15-10-18(34-14-25(26,27)28)3-5-19(15)16-2-4-20-17(11-16)6-9-30-23(20)13-31-22-12-29-8-7-21(22)24(32)33/h2-5,7-8,10-12,23,30-31H,6,9,13-14H2,1H3,(H,32,33)/t23-/m1/s1
US Patent
n/an/a<100n/an/an/an/an/an/a
Celgene Quanticel Research, Inc.
US Patent
Assay Description
The ability of test compounds to inhibit the activity of Jarid1B was determined in 384-well plate format under the following reaction conditions: 0.8...
US Patent US10059687 (2018)
BindingDB Entry DOI: 10.7270/Q2TM7D54
Lysine-specific demethylase 4C
(Homo sapiens (Human))
BDBM270496
(3-[({(1S)-6-[2-methyl-4-(2,2,2-trifluoroethoxy)phe...)
Show SMILES Cc1cc(OCC(F)(F)F)ccc1-c1ccc2[C@@H](CNc3cnccc3C(O)=O)NCCc2c1 |r|
Show InChI InChI=1S/C25H24F3N3O3/c1-15-10-18(34-14-25(26,27)28)3-5-19(15)16-2-4-20-17(11-16)6-9-30-23(20)13-31-22-12-29-8-7-21(22)24(32)33/h2-5,7-8,10-12,23,30-31H,6,9,13-14H2,1H3,(H,32,33)/t23-/m1/s1
US Patent
n/an/a 5.50E+3n/an/an/an/an/an/a
CELGENE QUANTICEL RESEARCH, INC.
US Patent
Assay Description
JMJD2C: The ability of test compounds to inhibit the activity of JMJD2C was determined in 384-well plate format under the following reaction conditio...
US Patent US11001568 (2021)
Lysine-specific demethylase 5B
(Homo sapiens (Human))
BDBM270496
(3-[({(1S)-6-[2-methyl-4-(2,2,2-trifluoroethoxy)phe...)
Show SMILES Cc1cc(OCC(F)(F)F)ccc1-c1ccc2[C@@H](CNc3cnccc3C(O)=O)NCCc2c1 |r|
Show InChI InChI=1S/C25H24F3N3O3/c1-15-10-18(34-14-25(26,27)28)3-5-19(15)16-2-4-20-17(11-16)6-9-30-23(20)13-31-22-12-29-8-7-21(22)24(32)33/h2-5,7-8,10-12,23,30-31H,6,9,13-14H2,1H3,(H,32,33)/t23-/m1/s1
US Patent
n/an/a<100n/an/an/an/an/an/a
CELGENE QUANTICEL RESEARCH, INC.
US Patent
Assay Description
Jarid1b: The ability of test compounds to inhibit the activity of Jarid1B was determined in 384-well plate format under the following reaction condit...
US Patent US11001568 (2021)
Lysine-specific demethylase 5B
(Homo sapiens (Human))
BDBM270496
(3-[({(1S)-6-[2-methyl-4-(2,2,2-trifluoroethoxy)phe...)
Show SMILES Cc1cc(OCC(F)(F)F)ccc1-c1ccc2[C@@H](CNc3cnccc3C(O)=O)NCCc2c1 |r|
Show InChI InChI=1S/C25H24F3N3O3/c1-15-10-18(34-14-25(26,27)28)3-5-19(15)16-2-4-20-17(11-16)6-9-30-23(20)13-31-22-12-29-8-7-21(22)24(32)33/h2-5,7-8,10-12,23,30-31H,6,9,13-14H2,1H3,(H,32,33)/t23-/m1/s1
US Patent
n/an/a<100n/an/an/an/an/an/a
CELGENE QUANTICEL RESEARCH, INC.
US Patent
Assay Description
Jarid1b: The ability of test compounds to inhibit the activity of Jarid1B was determined in 384-well plate format under the following reaction condit...
US Patent US11001568 (2021)
Lysine-specific demethylase 4C
(Homo sapiens (Human))
BDBM270496
(3-[({(1S)-6-[2-methyl-4-(2,2,2-trifluoroethoxy)phe...)
Show SMILES Cc1cc(OCC(F)(F)F)ccc1-c1ccc2[C@@H](CNc3cnccc3C(O)=O)NCCc2c1 |r|
Show InChI InChI=1S/C25H24F3N3O3/c1-15-10-18(34-14-25(26,27)28)3-5-19(15)16-2-4-20-17(11-16)6-9-30-23(20)13-31-22-12-29-8-7-21(22)24(32)33/h2-5,7-8,10-12,23,30-31H,6,9,13-14H2,1H3,(H,32,33)/t23-/m1/s1
US Patent
n/an/a 5.50E+3n/an/an/an/an/an/a
CELGENE QUANTICEL RESEARCH, INC.
US Patent
Assay Description
JMJD2C: The ability of test compounds to inhibit the activity of JMJD2C was determined in 384-well plate format under the following reaction conditio...
US Patent US11001568 (2021)
Lysine-specific demethylase 6B
(Homo sapiens (Human))
BDBM270496
(3-[({(1S)-6-[2-methyl-4-(2,2,2-trifluoroethoxy)phe...)
Show SMILES Cc1cc(OCC(F)(F)F)ccc1-c1ccc2[C@@H](CNc3cnccc3C(O)=O)NCCc2c1 |r|
Show InChI InChI=1S/C25H24F3N3O3/c1-15-10-18(34-14-25(26,27)28)3-5-19(15)16-2-4-20-17(11-16)6-9-30-23(20)13-31-22-12-29-8-7-21(22)24(32)33/h2-5,7-8,10-12,23,30-31H,6,9,13-14H2,1H3,(H,32,33)/t23-/m1/s1
US Patent
n/an/a 5.50E+3n/an/an/an/an/an/a
CELGENE QUANTICEL RESEARCH, INC.
US Patent
Assay Description
JMJD3: The enzymatic assay of JMJD3 activity is based upon Time Resolved-Fluorescence Resonance Energy Transfer (TR-FRET) detection. The ability of t...
US Patent US11001568 (2021)
Lysine-specific demethylase 6B
(Homo sapiens (Human))
BDBM270496
(3-[({(1S)-6-[2-methyl-4-(2,2,2-trifluoroethoxy)phe...)
Show SMILES Cc1cc(OCC(F)(F)F)ccc1-c1ccc2[C@@H](CNc3cnccc3C(O)=O)NCCc2c1 |r|
Show InChI InChI=1S/C25H24F3N3O3/c1-15-10-18(34-14-25(26,27)28)3-5-19(15)16-2-4-20-17(11-16)6-9-30-23(20)13-31-22-12-29-8-7-21(22)24(32)33/h2-5,7-8,10-12,23,30-31H,6,9,13-14H2,1H3,(H,32,33)/t23-/m1/s1
US Patent
n/an/a 5.50E+3n/an/an/an/an/an/a
CELGENE QUANTICEL RESEARCH, INC.
US Patent
Assay Description
JMJD3: The enzymatic assay of JMJD3 activity is based upon Time Resolved-Fluorescence Resonance Energy Transfer (TR-FRET) detection. The ability of t...
US Patent US11001568 (2021)