BDBM270510 (R)-3-(((6-(2-ethylphenyl)-1,2,3,4-tetrahydroiso-quinolin-1-yl)methyl)amino)isonicotinic acid::US10059687, Example 9A
SMILES: CCc1ccccc1-c1ccc2[C@H](CNc3cnccc3C(O)=O)NCCc2c1
InChI Key: InChIKey=DPXUPGGXVOBSKO-QHCPKHFHSA-N
Data: 6 IC50
Activity Spreadsheet -- Enzyme Inhibition Constant Data from BindingDB
Found 6 hits for monomerid = 270510
Trg + Lig
Ki
nM
ΔG°
kcal/mole
IC50
nM
Kd
nM
EC50/IC50
nM
koff
s-1
kon
M-1s-1
pHTemp
°C
Lysine-specific demethylase 4C
(Homo sapiens (Human))
BDBM270510
((R)-3-(((6-(2-ethylphenyl)-1,2,3,4-tetrahydroiso-q...)
Show SMILES CCc1ccccc1-c1ccc2[C@H](CNc3cnccc3C(O)=O)NCCc2c1 |r|
Show InChI InChI=1S/C24H25N3O2/c1-2-16-5-3-4-6-19(16)17-7-8-20-18(13-17)9-12-26-23(20)15-27-22-14-25-11-10-21(22)24(28)29/h3-8,10-11,13-14,23,26-27H,2,9,12,15H2,1H3,(H,28,29)/t23-/m0/s1
US Patent
n/an/a 5.50E+3n/an/an/an/an/an/a
Celgene Quanticel Research, Inc.
US Patent
Assay Description
The ability of test compounds to inhibit the activity of JMJD2C was determined in 384-well plate format under the following reaction conditions: 0.3 ...
US Patent US10059687 (2018)
BindingDB Entry DOI: 10.7270/Q2TM7D54
Lysine-specific demethylase 6B
(Homo sapiens (Human))
BDBM270510
((R)-3-(((6-(2-ethylphenyl)-1,2,3,4-tetrahydroiso-q...)
Show SMILES CCc1ccccc1-c1ccc2[C@H](CNc3cnccc3C(O)=O)NCCc2c1 |r|
Show InChI InChI=1S/C24H25N3O2/c1-2-16-5-3-4-6-19(16)17-7-8-20-18(13-17)9-12-26-23(20)15-27-22-14-25-11-10-21(22)24(28)29/h3-8,10-11,13-14,23,26-27H,2,9,12,15H2,1H3,(H,28,29)/t23-/m0/s1
US Patent
n/an/a 5.50E+3n/an/an/an/an/an/a
Celgene Quanticel Research, Inc.
US Patent
Assay Description
The enzymatic assay of JMJD3 activity is based upon Time Resolved-Fluorescence Resonance Energy Transfer (TR-FRET) detection. The ability of test com...
US Patent US10059687 (2018)
BindingDB Entry DOI: 10.7270/Q2TM7D54
Lysine-specific demethylase 5B
(Homo sapiens (Human))
BDBM270510
((R)-3-(((6-(2-ethylphenyl)-1,2,3,4-tetrahydroiso-q...)
Show SMILES CCc1ccccc1-c1ccc2[C@H](CNc3cnccc3C(O)=O)NCCc2c1 |r|
Show InChI InChI=1S/C24H25N3O2/c1-2-16-5-3-4-6-19(16)17-7-8-20-18(13-17)9-12-26-23(20)15-27-22-14-25-11-10-21(22)24(28)29/h3-8,10-11,13-14,23,26-27H,2,9,12,15H2,1H3,(H,28,29)/t23-/m0/s1
US Patent
n/an/a<100n/an/an/an/an/an/a
CELGENE QUANTICEL RESEARCH, INC.
US Patent
Assay Description
Jarid1b: The ability of test compounds to inhibit the activity of Jarid1B was determined in 384-well plate format under the following reaction condit...
US Patent US11001568 (2021)
Lysine-specific demethylase 4C
(Homo sapiens (Human))
BDBM270510
((R)-3-(((6-(2-ethylphenyl)-1,2,3,4-tetrahydroiso-q...)
Show SMILES CCc1ccccc1-c1ccc2[C@H](CNc3cnccc3C(O)=O)NCCc2c1 |r|
Show InChI InChI=1S/C24H25N3O2/c1-2-16-5-3-4-6-19(16)17-7-8-20-18(13-17)9-12-26-23(20)15-27-22-14-25-11-10-21(22)24(28)29/h3-8,10-11,13-14,23,26-27H,2,9,12,15H2,1H3,(H,28,29)/t23-/m0/s1
US Patent
n/an/a 5.50E+3n/an/an/an/an/an/a
CELGENE QUANTICEL RESEARCH, INC.
US Patent
Assay Description
JMJD2C: The ability of test compounds to inhibit the activity of JMJD2C was determined in 384-well plate format under the following reaction conditio...
US Patent US11001568 (2021)
Lysine-specific demethylase 6B
(Homo sapiens (Human))
BDBM270510
((R)-3-(((6-(2-ethylphenyl)-1,2,3,4-tetrahydroiso-q...)
Show SMILES CCc1ccccc1-c1ccc2[C@H](CNc3cnccc3C(O)=O)NCCc2c1 |r|
Show InChI InChI=1S/C24H25N3O2/c1-2-16-5-3-4-6-19(16)17-7-8-20-18(13-17)9-12-26-23(20)15-27-22-14-25-11-10-21(22)24(28)29/h3-8,10-11,13-14,23,26-27H,2,9,12,15H2,1H3,(H,28,29)/t23-/m0/s1
US Patent
n/an/a 5.50E+3n/an/an/an/an/an/a
CELGENE QUANTICEL RESEARCH, INC.
US Patent
Assay Description
JMJD3: The enzymatic assay of JMJD3 activity is based upon Time Resolved-Fluorescence Resonance Energy Transfer (TR-FRET) detection. The ability of t...
US Patent US11001568 (2021)
Lysine-specific demethylase 5B
(Homo sapiens (Human))
BDBM270510
((R)-3-(((6-(2-ethylphenyl)-1,2,3,4-tetrahydroiso-q...)
Show SMILES CCc1ccccc1-c1ccc2[C@H](CNc3cnccc3C(O)=O)NCCc2c1 |r|
Show InChI InChI=1S/C24H25N3O2/c1-2-16-5-3-4-6-19(16)17-7-8-20-18(13-17)9-12-26-23(20)15-27-22-14-25-11-10-21(22)24(28)29/h3-8,10-11,13-14,23,26-27H,2,9,12,15H2,1H3,(H,28,29)/t23-/m0/s1
US Patent
n/an/a<100n/an/an/an/an/an/a
Celgene Quanticel Research, Inc.
US Patent
Assay Description
The ability of test compounds to inhibit the activity of Jarid1B was determined in 384-well plate format under the following reaction conditions: 0.8...
US Patent US10059687 (2018)
BindingDB Entry DOI: 10.7270/Q2TM7D54