BDBM270514 (R)-3-(((2-methyl-6-(methyl(p-tolyl)amino)-1,2,3,4-tetra-hydroisoquinolin-1-yl)methyl)amino)isonicotinicacid::US10059687, Example 11A
SMILES: CN(c1ccc(C)cc1)c1ccc2[C@H](CNc3cnccc3C(O)=O)N(C)CCc2c1
InChI Key: InChIKey=XPFXTEUBSPDERX-DEOSSOPVSA-N
Data: 6 IC50
Activity Spreadsheet -- Enzyme Inhibition Constant Data from BindingDB
Found 6 hits for monomerid = 270514
Trg + Lig
Ki
nM
ΔG°
kcal/mole
IC50
nM
Kd
nM
EC50/IC50
nM
koff
s-1
kon
M-1s-1
pHTemp
°C
Lysine-specific demethylase 4C
(Homo sapiens (Human))
BDBM270514
((R)-3-(((2-methyl-6-(methyl(p-tolyl)amino)-1,2,3,4...)
Show SMILES CN(c1ccc(C)cc1)c1ccc2[C@H](CNc3cnccc3C(O)=O)N(C)CCc2c1 |r|
Show InChI InChI=1S/C25H28N4O2/c1-17-4-6-19(7-5-17)29(3)20-8-9-21-18(14-20)11-13-28(2)24(21)16-27-23-15-26-12-10-22(23)25(30)31/h4-10,12,14-15,24,27H,11,13,16H2,1-3H3,(H,30,31)/t24-/m0/s1
US Patent
n/an/a 550n/an/an/an/an/an/a
Celgene Quanticel Research, Inc.
US Patent
Assay Description
The ability of test compounds to inhibit the activity of JMJD2C was determined in 384-well plate format under the following reaction conditions: 0.3 ...
US Patent US10059687 (2018)
BindingDB Entry DOI: 10.7270/Q2TM7D54
Lysine-specific demethylase 6B
(Homo sapiens (Human))
BDBM270514
((R)-3-(((2-methyl-6-(methyl(p-tolyl)amino)-1,2,3,4...)
Show SMILES CN(c1ccc(C)cc1)c1ccc2[C@H](CNc3cnccc3C(O)=O)N(C)CCc2c1 |r|
Show InChI InChI=1S/C25H28N4O2/c1-17-4-6-19(7-5-17)29(3)20-8-9-21-18(14-20)11-13-28(2)24(21)16-27-23-15-26-12-10-22(23)25(30)31/h4-10,12,14-15,24,27H,11,13,16H2,1-3H3,(H,30,31)/t24-/m0/s1
US Patent
n/an/a 5.50E+3n/an/an/an/an/an/a
Celgene Quanticel Research, Inc.
US Patent
Assay Description
The enzymatic assay of JMJD3 activity is based upon Time Resolved-Fluorescence Resonance Energy Transfer (TR-FRET) detection. The ability of test com...
US Patent US10059687 (2018)
BindingDB Entry DOI: 10.7270/Q2TM7D54
Lysine-specific demethylase 5B
(Homo sapiens (Human))
BDBM270514
((R)-3-(((2-methyl-6-(methyl(p-tolyl)amino)-1,2,3,4...)
Show SMILES CN(c1ccc(C)cc1)c1ccc2[C@H](CNc3cnccc3C(O)=O)N(C)CCc2c1 |r|
Show InChI InChI=1S/C25H28N4O2/c1-17-4-6-19(7-5-17)29(3)20-8-9-21-18(14-20)11-13-28(2)24(21)16-27-23-15-26-12-10-22(23)25(30)31/h4-10,12,14-15,24,27H,11,13,16H2,1-3H3,(H,30,31)/t24-/m0/s1
US Patent
n/an/a<100n/an/an/an/an/an/a
CELGENE QUANTICEL RESEARCH, INC.
US Patent
Assay Description
Jarid1b: The ability of test compounds to inhibit the activity of Jarid1B was determined in 384-well plate format under the following reaction condit...
US Patent US11001568 (2021)
Lysine-specific demethylase 4C
(Homo sapiens (Human))
BDBM270514
((R)-3-(((2-methyl-6-(methyl(p-tolyl)amino)-1,2,3,4...)
Show SMILES CN(c1ccc(C)cc1)c1ccc2[C@H](CNc3cnccc3C(O)=O)N(C)CCc2c1 |r|
Show InChI InChI=1S/C25H28N4O2/c1-17-4-6-19(7-5-17)29(3)20-8-9-21-18(14-20)11-13-28(2)24(21)16-27-23-15-26-12-10-22(23)25(30)31/h4-10,12,14-15,24,27H,11,13,16H2,1-3H3,(H,30,31)/t24-/m0/s1
US Patent
n/an/a 550n/an/an/an/an/an/a
CELGENE QUANTICEL RESEARCH, INC.
US Patent
Assay Description
JMJD2C: The ability of test compounds to inhibit the activity of JMJD2C was determined in 384-well plate format under the following reaction conditio...
US Patent US11001568 (2021)
Lysine-specific demethylase 6B
(Homo sapiens (Human))
BDBM270514
((R)-3-(((2-methyl-6-(methyl(p-tolyl)amino)-1,2,3,4...)
Show SMILES CN(c1ccc(C)cc1)c1ccc2[C@H](CNc3cnccc3C(O)=O)N(C)CCc2c1 |r|
Show InChI InChI=1S/C25H28N4O2/c1-17-4-6-19(7-5-17)29(3)20-8-9-21-18(14-20)11-13-28(2)24(21)16-27-23-15-26-12-10-22(23)25(30)31/h4-10,12,14-15,24,27H,11,13,16H2,1-3H3,(H,30,31)/t24-/m0/s1
US Patent
n/an/a 5.50E+3n/an/an/an/an/an/a
CELGENE QUANTICEL RESEARCH, INC.
US Patent
Assay Description
JMJD3: The enzymatic assay of JMJD3 activity is based upon Time Resolved-Fluorescence Resonance Energy Transfer (TR-FRET) detection. The ability of t...
US Patent US11001568 (2021)
Lysine-specific demethylase 5B
(Homo sapiens (Human))
BDBM270514
((R)-3-(((2-methyl-6-(methyl(p-tolyl)amino)-1,2,3,4...)
Show SMILES CN(c1ccc(C)cc1)c1ccc2[C@H](CNc3cnccc3C(O)=O)N(C)CCc2c1 |r|
Show InChI InChI=1S/C25H28N4O2/c1-17-4-6-19(7-5-17)29(3)20-8-9-21-18(14-20)11-13-28(2)24(21)16-27-23-15-26-12-10-22(23)25(30)31/h4-10,12,14-15,24,27H,11,13,16H2,1-3H3,(H,30,31)/t24-/m0/s1
US Patent
n/an/a<100n/an/an/an/an/an/a
Celgene Quanticel Research, Inc.
US Patent
Assay Description
The ability of test compounds to inhibit the activity of Jarid1B was determined in 384-well plate format under the following reaction conditions: 0.8...
US Patent US10059687 (2018)
BindingDB Entry DOI: 10.7270/Q2TM7D54