BDBM27079 N-{3-[5-(morpholin-4-ylmethyl)-1H-1,3-benzodiazol-2-yl]-1H-pyrazol-4-yl}benzamide::pyrazole-benzimidazole amide analogue, 8
SMILES: O=C(Nc1c[nH]nc1-c1nc2ccc(CN3CCOCC3)cc2[nH]1)c1ccccc1
InChI Key: InChIKey=CMEKRUHUVGTVLK-UHFFFAOYSA-N
Data: 4 IC50
Activity Spreadsheet -- Enzyme Inhibition Constant Data from BindingDB
Found 4 hits for monomerid = 27079
Trg + Lig
Ki
nM
ΔG°
kcal/mole
IC50
nM
Kd
nM
EC50/IC50
nM
koff
s-1
kon
M-1s-1
pHTemp
°C
Aurora kinase A
(Homo sapiens (Human))
BDBM27079
(N-{3-[5-(morpholin-4-ylmethyl)-1H-1,3-benzodiazol-...)
Show SMILES O=C(Nc1c[nH]nc1-c1nc2ccc(CN3CCOCC3)cc2[nH]1)c1ccccc1
Show InChI InChI=1S/C22H22N6O2/c29-22(16-4-2-1-3-5-16)26-19-13-23-27-20(19)21-24-17-7-6-15(12-18(17)25-21)14-28-8-10-30-11-9-28/h1-7,12-13H,8-11,14H2,(H,23,27)(H,24,25)(H,26,29)
NCI pathway
Reactome pathway
n/an/a 3.5n/an/an/an/a7.022
Astex
Assay Description
Assays for Aurora kinase was performed in a DELFIA format. Aurora enzyme was incubated with test compound and cross-tide substrate in the reaction bu...
J Med Chem 52: 379-88 (2009)
Article DOI: 10.1021/jm800984v
BindingDB Entry DOI: 10.7270/Q2P55KT7
3D
3D Structure (docked)
Cyclin-Dependent Kinase 2 (CDK2)
(Homo sapiens (Human))
BDBM27079
(N-{3-[5-(morpholin-4-ylmethyl)-1H-1,3-benzodiazol-...)
Show SMILES O=C(Nc1c[nH]nc1-c1nc2ccc(CN3CCOCC3)cc2[nH]1)c1ccccc1
Show InChI InChI=1S/C22H22N6O2/c29-22(16-4-2-1-3-5-16)26-19-13-23-27-20(19)21-24-17-7-6-15(12-18(17)25-21)14-28-8-10-30-11-9-28/h1-7,12-13H,8-11,14H2,(H,23,27)(H,24,25)(H,26,29)
NCI pathway
Reactome pathway
n/an/a 140n/an/an/an/an/an/a
Astex
Assay Description
CDK2/cyclinA activity was determined using a radiometric assay to measure the incorporation of gamma-phosphate from [gamma-33P]-ATP into histone H1. ...
J Med Chem 52: 379-88 (2009)
Article DOI: 10.1021/jm800984v
BindingDB Entry DOI: 10.7270/Q2P55KT7
Cyclin-Dependent Kinase 1 (CDK1)
(Homo sapiens (Human))
BDBM27079
(N-{3-[5-(morpholin-4-ylmethyl)-1H-1,3-benzodiazol-...)
Show SMILES O=C(Nc1c[nH]nc1-c1nc2ccc(CN3CCOCC3)cc2[nH]1)c1ccccc1
Show InChI InChI=1S/C22H22N6O2/c29-22(16-4-2-1-3-5-16)26-19-13-23-27-20(19)21-24-17-7-6-15(12-18(17)25-21)14-28-8-10-30-11-9-28/h1-7,12-13H,8-11,14H2,(H,23,27)(H,24,25)(H,26,29)
Reactome pathway
n/an/a 340n/an/an/an/an/an/a
Astex
Assay Description
CDK1/cyclinB activity was determined using a radiometric assay to measure the incorporation of gamma-phosphate from [gamma-33P]-ATP into histone H1. ...
J Med Chem 52: 379-88 (2009)
Article DOI: 10.1021/jm800984v
BindingDB Entry DOI: 10.7270/Q2P55KT7
Aurora kinase B
(Homo sapiens (Human))
BDBM27079
(N-{3-[5-(morpholin-4-ylmethyl)-1H-1,3-benzodiazol-...)
Show SMILES O=C(Nc1c[nH]nc1-c1nc2ccc(CN3CCOCC3)cc2[nH]1)c1ccccc1
Show InChI InChI=1S/C22H22N6O2/c29-22(16-4-2-1-3-5-16)26-19-13-23-27-20(19)21-24-17-7-6-15(12-18(17)25-21)14-28-8-10-30-11-9-28/h1-7,12-13H,8-11,14H2,(H,23,27)(H,24,25)(H,26,29)
Reactome pathway
n/an/a 15n/an/an/an/a8.522
Astex
Assay Description
Assays for Aurora kinase was performed in a DELFIA format. Aurora enzyme was incubated with test compound and cross-tide substrate in the reaction bu...
J Med Chem 52: 379-88 (2009)
Article DOI: 10.1021/jm800984v
BindingDB Entry DOI: 10.7270/Q2P55KT7