null
SMILES: CC(C)c1nc(NS(=O)(=O)c2ccc3CCN(Cc3c2)[C@H](C)c2ccc(OCC(F)(F)F)nc2)no1
InChI Key: InChIKey=KONROMUWHPRIQA-OAHLLOKOSA-N
Activity Spreadsheet -- Enzyme Inhibition Constant Data from BindingDB
Found 1 hit for monomerid = 272058
Trg + Lig
Ki
nM
ΔG°
kcal/mole
IC50
nM
Kd
nM
EC50/IC50
nM
koff
s-1
kon
M-1s-1
pHTemp
°C
Alpha-1,6-mannosyl-glycoprotein 2-beta-N-acetylglucosaminyltransferase
(Homo sapiens (Human))
BDBM272058
(US10065945, Example 8)
Show SMILES CC(C)c1nc(NS(=O)(=O)c2ccc3CCN(Cc3c2)[C@H](C)c2ccc(OCC(F)(F)F)nc2)no1 |r|
Show InChI InChI=1S/C23H26F3N5O4S/c1-14(2)21-28-22(29-35-21)30-36(32,33)19-6-4-16-8-9-31(12-18(16)10-19)15(3)17-5-7-20(27-11-17)34-13-23(24,25)26/h4-7,10-11,14-15H,8-9,12-13H2,1-3H3,(H,29,30)/t15-/m1/s1
US Patent
n/an/a 13n/an/an/an/an/a25
Merck Sharp & Dohme Corp.
US Patent
Assay Description
A solution of 1 M LiHMDS in THF (51.7 ml, 51.7 mmol) was added dropwise to a mixture of Intermediate 3 (7.5 g, 17.2 mmol) and 5-(tert-butyl)-4-methyl...
US Patent US10065945 (2018)
BindingDB Entry DOI: 10.7270/Q24X59TJ