BDBM272081 (S)-1-(2,4-Difluorophenyl)-5-(3-fluoro-2- methylphenyl)-N-hydroxy-1,4,5,6- tetrahydrocyclopenta[c]pyrazole-5-carboxamide::US10065948, 17::US10457675, Example 17
SMILES: Cc1c(F)cccc1[C@@]1(Cc2cnn(c2C1)-c1ccc(F)cc1F)C(=O)NO
InChI Key: InChIKey=SBTHBMZRBFFHGV-FQEVSTJZSA-N
Data: 2 IC50
Activity Spreadsheet -- Enzyme Inhibition Constant Data from BindingDB
Found 2 hits for monomerid = 272081
Trg + Lig
Ki
nM
ΔG°
kcal/mole
IC50
nM
Kd
nM
EC50/IC50
nM
koff
s-1
kon
M-1s-1
pHTemp
°C
Histone deacetylase 9
(Homo sapiens (Human))
BDBM272081
((S)-1-(2,4-Difluorophenyl)-5-(3-fluoro-2- methylph...)
Show SMILES Cc1c(F)cccc1[C@@]1(Cc2cnn(c2C1)-c1ccc(F)cc1F)C(=O)NO |r|
Show InChI InChI=1S/C20H16F3N3O2/c1-11-14(3-2-4-15(11)22)20(19(27)25-28)8-12-10-24-26(18(12)9-20)17-6-5-13(21)7-16(17)23/h2-7,10,28H,8-9H2,1H3,(H,25,27)/t20-/m0/s1
Reactome pathway
US Patent
n/an/a 29n/an/an/an/an/an/a
CHDI Foundation, Inc.
US Patent
Assay Description
The potency of the compounds is quantified by measuring the Histone Deacetylase 9 (HDAC9) enzymatic activity using the fluorogenic substrate, Boc-Lys...
US Patent US10457675 (2019)
BindingDB Entry DOI: 10.7270/Q22J6F7J
Histone deacetylase 9
(Homo sapiens (Human))
BDBM272081
((S)-1-(2,4-Difluorophenyl)-5-(3-fluoro-2- methylph...)
Show SMILES Cc1c(F)cccc1[C@@]1(Cc2cnn(c2C1)-c1ccc(F)cc1F)C(=O)NO |r|
Show InChI InChI=1S/C20H16F3N3O2/c1-11-14(3-2-4-15(11)22)20(19(27)25-28)8-12-10-24-26(18(12)9-20)17-6-5-13(21)7-16(17)23/h2-7,10,28H,8-9H2,1H3,(H,25,27)/t20-/m0/s1
Reactome pathway
US Patent
n/an/a 29n/an/an/an/an/an/a
CHDI Foundation, Inc.
US Patent
Assay Description
The potency of the compounds is quantified by measuring the Histone Deacetylase 9 (HDAC9) enzymatic activity using the fluorogenic substrate, Boc-Lys...
US Patent US10065948 (2018)
BindingDB Entry DOI: 10.7270/Q2154K23