BDBM2722 3-[2-(6-chloro-3-ethoxy-2-fluorophenyl)cyclopropyl]-1-(5-chloropyridin-2-yl)urea::N-[cis-2-(6-Chloro-3-ethoxy-2-fluorophenyl)cyclopropyl]-N-[2-(5-chloropyridyl)]urea::urea-PETT deriv. 7
SMILES: CCOc1ccc(Cl)c(C2CC2NC(=O)Nc2ccc(Cl)cn2)c1F
InChI Key: InChIKey=GQMFTUBBCVWGHH-UHFFFAOYSA-N
Data: 3 IC50
Activity Spreadsheet -- Enzyme Inhibition Constant Data from BindingDB
Found 3 hits for monomerid = 2722
Trg + Lig
Ki
nM
ΔG°
kcal/mole
IC50
nM
Kd
nM
EC50/IC50
nM
koff
s-1
kon
M-1s-1
pHTemp
°C
HIV-1 Reverse Transcriptase
(Human immunodeficiency virus type 1)
BDBM2722
(3-[2-(6-chloro-3-ethoxy-2-fluorophenyl)cyclopropyl...)
Show SMILES CCOc1ccc(Cl)c(C2CC2NC(=O)Nc2ccc(Cl)cn2)c1F
Show InChI InChI=1S/C17H16Cl2FN3O2/c1-2-25-13-5-4-11(19)15(16(13)20)10-7-12(10)22-17(24)23-14-6-3-9(18)8-21-14/h3-6,8,10,12H,2,7H2,1H3,(H2,21,22,23,24)
n/an/a 1.30n/an/an/an/a7.837
Medivir AB
Assay Description
The IC50 of reverse transcriptase is the concentration that inhibits 50% of recombinant HIV-1 RT RNA-directed DNA polymerase activity in vitro.
J Med Chem 42: 4150-60 (1999)
Article DOI: 10.1021/jm990095j
BindingDB Entry DOI: 10.7270/Q25X273G
HIV-1 Reverse Transcriptase Mutant (K103N)
(Human immunodeficiency virus type 1)
BDBM2722
(3-[2-(6-chloro-3-ethoxy-2-fluorophenyl)cyclopropyl...)
Show SMILES CCOc1ccc(Cl)c(C2CC2NC(=O)Nc2ccc(Cl)cn2)c1F
Show InChI InChI=1S/C17H16Cl2FN3O2/c1-2-25-13-5-4-11(19)15(16(13)20)10-7-12(10)22-17(24)23-14-6-3-9(18)8-21-14/h3-6,8,10,12H,2,7H2,1H3,(H2,21,22,23,24)
n/an/a 237n/an/an/an/a7.837
Medivir AB
Assay Description
The IC50 of reverse transcriptase is the concentration that inhibits 50% of recombinant HIV-1 RT RNA-directed DNA polymerase activity in vitro.
J Med Chem 42: 4150-60 (1999)
Article DOI: 10.1021/jm990095j
BindingDB Entry DOI: 10.7270/Q25X273G
HIV-1 Reverse Transcriptase Mutant (Y181C)
(Human immunodeficiency virus type 1)
BDBM2722
(3-[2-(6-chloro-3-ethoxy-2-fluorophenyl)cyclopropyl...)
Show SMILES CCOc1ccc(Cl)c(C2CC2NC(=O)Nc2ccc(Cl)cn2)c1F
Show InChI InChI=1S/C17H16Cl2FN3O2/c1-2-25-13-5-4-11(19)15(16(13)20)10-7-12(10)22-17(24)23-14-6-3-9(18)8-21-14/h3-6,8,10,12H,2,7H2,1H3,(H2,21,22,23,24)
n/an/a 21n/an/an/an/a7.837
Medivir AB
Assay Description
The IC50 of reverse transcriptase is the concentration that inhibits 50% of recombinant HIV-1 RT RNA-directed DNA polymerase activity in vitro.
J Med Chem 42: 4150-60 (1999)
Article DOI: 10.1021/jm990095j
BindingDB Entry DOI: 10.7270/Q25X273G