BDBM27374 2-(2-aminopyrimidin-4-yl)-7-(3,3,3-trifluoropropyl)-1H,4H,5H,6H,7H-pyrrolo[3,2-c]pyridin-4-one::Pyrrolopyridinone, 93
SMILES: Nc1nccc(n1)-c1cc2c([nH]1)C(CCC(F)(F)F)CNC2=O
InChI Key: InChIKey=HOLYMSXFIGUWKL-UHFFFAOYSA-N
Data: 1 IC50
Activity Spreadsheet -- Enzyme Inhibition Constant Data from BindingDB
Found 1 hit for monomerid = 27374
Trg + Lig
Ki
nM
ΔG°
kcal/mole
IC50
nM
Kd
nM
EC50/IC50
nM
koff
s-1
kon
M-1s-1
pHTemp
°C
Cdc7 Kinase
(Homo sapiens (Human))
BDBM27374
(2-(2-aminopyrimidin-4-yl)-7-(3,3,3-trifluoropropyl...)
Show SMILES Nc1nccc(n1)-c1cc2c([nH]1)C(CCC(F)(F)F)CNC2=O
Show InChI InChI=1S/C14H14F3N5O/c15-14(16,17)3-1-7-6-20-12(23)8-5-10(21-11(7)8)9-2-4-19-13(18)22-9/h2,4-5,7,21H,1,3,6H2,(H,20,23)(H2,18,19,22)
Reactome pathway
n/an/a 10n/an/an/an/an/an/a
Nerviano Medical Sciences Srl
Assay Description
The potency of the compound toward kinase activity was determined using a Dowex resin-based assay. The substrate was phosphorylated by kinase in the ...
J Med Chem 52: 293-307 (2009)
Article DOI: 10.1021/jm800977q
BindingDB Entry DOI: 10.7270/Q27W69JX