BDBM273770 US10071079, Example 556::US10071079, Example 557::US10478424, Example 557
SMILES: CC(C)c1c([nH]c2ccc(cc12)C1CCN(CC1)C1CCOC1)-c1cc(c2ncnn2c1)C(F)(F)F
InChI Key:
Data: 12 IC50
Activity Spreadsheet -- Enzyme Inhibition Constant Data from BindingDB
Found 12 hits for monomerid = 273770
Trg + Lig
Ki
nM
ΔG°
kcal/mole
IC50
nM
Kd
nM
EC50/IC50
nM
koff
s-1
kon
M-1s-1
pHTemp
°C
Toll-like receptor 7
(Homo sapiens (Human))
BDBM273770
(US10071079, Example 556 | US10071079, Example 557 ...)
Show SMILES CC(C)c1c([nH]c2ccc(cc12)C1CCN(CC1)C1CCOC1)-c1cc(c2ncnn2c1)C(F)(F)F
US Patent
n/an/a 0.400n/an/an/an/an/a25
Bristol-Myers Squibb Company
US Patent
Assay Description
HEK-Blue-cells (Invivogen) overexpressing human TLR7, TLR8 or TLR9 receptors were used for screening inhibitors of these receptors using an inducible...
US Patent US10071079 (2018)
BindingDB Entry DOI: 10.7270/Q2VD71GV
Toll-like receptor 8
(Homo sapiens (Human))
BDBM273770
(US10071079, Example 556 | US10071079, Example 557 ...)
Show SMILES CC(C)c1c([nH]c2ccc(cc12)C1CCN(CC1)C1CCOC1)-c1cc(c2ncnn2c1)C(F)(F)F
US Patent
n/an/a 5.5n/an/an/an/an/a25
Bristol-Myers Squibb Company
US Patent
Assay Description
HEK-Blue-cells (Invivogen) overexpressing human TLR7, TLR8 or TLR9 receptors were used for screening inhibitors of these receptors using an inducible...
US Patent US10071079 (2018)
BindingDB Entry DOI: 10.7270/Q2VD71GV
Toll-like receptor 9
(Homo sapiens (Human))
BDBM273770
(US10071079, Example 556 | US10071079, Example 557 ...)
Show SMILES CC(C)c1c([nH]c2ccc(cc12)C1CCN(CC1)C1CCOC1)-c1cc(c2ncnn2c1)C(F)(F)F
US Patent
n/an/a 3.92E+3n/an/an/an/an/a25
Bristol-Myers Squibb Company
US Patent
Assay Description
HEK-Blue-cells (Invivogen) overexpressing human TLR7, TLR8 or TLR9 receptors were used for screening inhibitors of these receptors using an inducible...
US Patent US10071079 (2018)
BindingDB Entry DOI: 10.7270/Q2VD71GV
Toll-like receptor 7
(Homo sapiens (Human))
BDBM273770
(US10071079, Example 556 | US10071079, Example 557 ...)
Show SMILES CC(C)c1c([nH]c2ccc(cc12)C1CCN(CC1)C1CCOC1)-c1cc(c2ncnn2c1)C(F)(F)F
US Patent
n/an/a 0.400n/an/an/an/an/a25
Bristol-Myers Squibb Company
US Patent
Assay Description
HEK-Blue-cells (Invivogen) overexpressing human TLR7, TLR8 or TLR9 receptors were used for screening inhibitors of these receptors using an inducible...
US Patent US10071079 (2018)
BindingDB Entry DOI: 10.7270/Q2VD71GV
Toll-like receptor 8
(Homo sapiens (Human))
BDBM273770
(US10071079, Example 556 | US10071079, Example 557 ...)
Show SMILES CC(C)c1c([nH]c2ccc(cc12)C1CCN(CC1)C1CCOC1)-c1cc(c2ncnn2c1)C(F)(F)F
US Patent
n/an/a 6.5n/an/an/an/an/a25
Bristol-Myers Squibb Company
US Patent
Assay Description
HEK-Blue-cells (Invivogen) overexpressing human TLR7, TLR8 or TLR9 receptors were used for screening inhibitors of these receptors using an inducible...
US Patent US10071079 (2018)
BindingDB Entry DOI: 10.7270/Q2VD71GV
Toll-like receptor 9
(Homo sapiens (Human))
BDBM273770
(US10071079, Example 556 | US10071079, Example 557 ...)
Show SMILES CC(C)c1c([nH]c2ccc(cc12)C1CCN(CC1)C1CCOC1)-c1cc(c2ncnn2c1)C(F)(F)F
US Patent
n/an/a 2.73E+3n/an/an/an/an/an/a
Bristol-Myers Squibb Company
US Patent
Assay Description
HEK-Blue-cells (Invivogen) overexpressing human TLR7, TLR8 or TLR9 receptors were used for screening inhibitors of these receptors using an inducible...
US Patent US10478424 (2019)
BindingDB Entry DOI: 10.7270/Q2QZ2DB0
Toll-like receptor 7
(Homo sapiens (Human))
BDBM273770
(US10071079, Example 556 | US10071079, Example 557 ...)
Show SMILES CC(C)c1c([nH]c2ccc(cc12)C1CCN(CC1)C1CCOC1)-c1cc(c2ncnn2c1)C(F)(F)F
US Patent
n/an/a 0.400n/an/an/an/an/an/a
Bristol-Myers Squibb Company
US Patent
Assay Description
HEK-Blue-cells (Invivogen) overexpressing human TLR7, TLR8 or TLR9 receptors were used for screening inhibitors of these receptors using an inducible...
US Patent US10478424 (2019)
BindingDB Entry DOI: 10.7270/Q2QZ2DB0
Toll-like receptor 8
(Homo sapiens (Human))
BDBM273770
(US10071079, Example 556 | US10071079, Example 557 ...)
Show SMILES CC(C)c1c([nH]c2ccc(cc12)C1CCN(CC1)C1CCOC1)-c1cc(c2ncnn2c1)C(F)(F)F
US Patent
n/an/a 5.5n/an/an/an/an/an/a
Bristol-Myers Squibb Company
US Patent
Assay Description
HEK-Blue-cells (Invivogen) overexpressing human TLR7, TLR8 or TLR9 receptors were used for screening inhibitors of these receptors using an inducible...
US Patent US10478424 (2019)
BindingDB Entry DOI: 10.7270/Q2QZ2DB0
Toll-like receptor 9
(Homo sapiens (Human))
BDBM273770
(US10071079, Example 556 | US10071079, Example 557 ...)
Show SMILES CC(C)c1c([nH]c2ccc(cc12)C1CCN(CC1)C1CCOC1)-c1cc(c2ncnn2c1)C(F)(F)F
US Patent
n/an/a 3.92E+3n/an/an/an/an/an/a
Bristol-Myers Squibb Company
US Patent
Assay Description
HEK-Blue-cells (Invivogen) overexpressing human TLR7, TLR8 or TLR9 receptors were used for screening inhibitors of these receptors using an inducible...
US Patent US10478424 (2019)
BindingDB Entry DOI: 10.7270/Q2QZ2DB0
Toll-like receptor 7
(Homo sapiens (Human))
BDBM273770
(US10071079, Example 556 | US10071079, Example 557 ...)
Show SMILES CC(C)c1c([nH]c2ccc(cc12)C1CCN(CC1)C1CCOC1)-c1cc(c2ncnn2c1)C(F)(F)F
US Patent
n/an/a 0.400n/an/an/an/an/an/a
Bristol-Myers Squibb Company
US Patent
Assay Description
HEK-Blue-cells (Invivogen) overexpressing human TLR7, TLR8 or TLR9 receptors were used for screening inhibitors of these receptors using an inducible...
US Patent US10478424 (2019)
BindingDB Entry DOI: 10.7270/Q2QZ2DB0
Toll-like receptor 8
(Homo sapiens (Human))
BDBM273770
(US10071079, Example 556 | US10071079, Example 557 ...)
Show SMILES CC(C)c1c([nH]c2ccc(cc12)C1CCN(CC1)C1CCOC1)-c1cc(c2ncnn2c1)C(F)(F)F
US Patent
n/an/a 6.5n/an/an/an/an/an/a
Bristol-Myers Squibb Company
US Patent
Assay Description
HEK-Blue-cells (Invivogen) overexpressing human TLR7, TLR8 or TLR9 receptors were used for screening inhibitors of these receptors using an inducible...
US Patent US10478424 (2019)
BindingDB Entry DOI: 10.7270/Q2QZ2DB0
Toll-like receptor 9
(Homo sapiens (Human))
BDBM273770
(US10071079, Example 556 | US10071079, Example 557 ...)
Show SMILES CC(C)c1c([nH]c2ccc(cc12)C1CCN(CC1)C1CCOC1)-c1cc(c2ncnn2c1)C(F)(F)F
US Patent
n/an/a 2.73E+3n/an/an/an/an/a25
Bristol-Myers Squibb Company
US Patent
Assay Description
HEK-Blue-cells (Invivogen) overexpressing human TLR7, TLR8 or TLR9 receptors were used for screening inhibitors of these receptors using an inducible...
US Patent US10071079 (2018)
BindingDB Entry DOI: 10.7270/Q2VD71GV