BDBM27384 2-{1H-pyrrolo[2,3-b]pyridin-4-yl}-1H,4H,5H,6H,7H-pyrrolo[3,2-c]pyridin-4-one::pyrrolopyridinone scaffold, 6
SMILES: O=C1NCCc2[nH]c(cc12)-c1ccnc2[nH]ccc12
InChI Key: InChIKey=AFWVTAGILHVGGN-UHFFFAOYSA-N
Data: 1 IC50
Activity Spreadsheet -- Enzyme Inhibition Constant Data from BindingDB
Found 1 hit for monomerid = 27384
Trg + Lig
Ki
nM
ΔG°
kcal/mole
IC50
nM
Kd
nM
EC50/IC50
nM
koff
s-1
kon
M-1s-1
pHTemp
°C
Cdc7 Kinase
(Homo sapiens (Human))
BDBM27384
(2-{1H-pyrrolo[2,3-b]pyridin-4-yl}-1H,4H,5H,6H,7H-p...)
Show SMILES O=C1NCCc2[nH]c(cc12)-c1ccnc2[nH]ccc12
Show InChI InChI=1S/C14H12N4O/c19-14-10-7-12(18-11(10)3-6-17-14)8-1-4-15-13-9(8)2-5-16-13/h1-2,4-5,7,18H,3,6H2,(H,15,16)(H,17,19)
Reactome pathway
n/an/a 14n/an/an/an/a7.925
Nerviano Medical Sciences Srl
Assay Description
The potency of the compound toward kinase activity was determined using a Dowex resin-based assay. The substrate was phosphorylated by kinase in the ...
J Med Chem 51: 487-501 (2008)
Article DOI: 10.1021/jm700956r
BindingDB Entry DOI: 10.7270/Q247485B