BDBM27396 2-(pyridin-4-yl)-4H,5H,6H,7H-furo[3,2-c]pyridin-4-one::pyrrolopyridinone scaffold, 18
SMILES: O=C1NCCc2oc(cc12)-c1ccncc1
InChI Key: InChIKey=KWWOJRSKUDOFSA-UHFFFAOYSA-N
Data: 1 IC50
Activity Spreadsheet -- Enzyme Inhibition Constant Data from BindingDB
Found 1 hit for monomerid = 27396
Trg + Lig
Ki
nM
ΔG°
kcal/mole
IC50
nM
Kd
nM
EC50/IC50
nM
koff
s-1
kon
M-1s-1
pHTemp
°C
Cdc7 Kinase
(Homo sapiens (Human))
BDBM27396
(2-(pyridin-4-yl)-4H,5H,6H,7H-furo[3,2-c]pyridin-4-...)
Show SMILES O=C1NCCc2oc(cc12)-c1ccncc1
Show InChI InChI=1S/C12H10N2O2/c15-12-9-7-11(8-1-4-13-5-2-8)16-10(9)3-6-14-12/h1-2,4-5,7H,3,6H2,(H,14,15)
Reactome pathway
n/an/a 201n/an/an/an/a7.925
Nerviano Medical Sciences Srl
Assay Description
The potency of the compound toward kinase activity was determined using a Dowex resin-based assay. The substrate was phosphorylated by kinase in the ...
J Med Chem 51: 487-501 (2008)
Article DOI: 10.1021/jm700956r
BindingDB Entry DOI: 10.7270/Q247485B