BDBM27398 2-(pyridin-4-yl)-1H,4H,5H,6H,7H,8H-pyrrolo[3,2-c]azepin-4-one::pyrrolopyridinone scaffold, 20
SMILES: O=C1NCCCc2[nH]c(cc12)-c1ccncc1
InChI Key: InChIKey=HNRVTFRFDNDIEV-UHFFFAOYSA-N
Data: 1 IC50
Activity Spreadsheet -- Enzyme Inhibition Constant Data from BindingDB
Found 1 hit for monomerid = 27398
Trg + Lig
Ki
nM
ΔG°
kcal/mole
IC50
nM
Kd
nM
EC50/IC50
nM
koff
s-1
kon
M-1s-1
pHTemp
°C
Cdc7 Kinase
(Homo sapiens (Human))
BDBM27398
(2-(pyridin-4-yl)-1H,4H,5H,6H,7H,8H-pyrrolo[3,2-c]a...)
Show SMILES O=C1NCCCc2[nH]c(cc12)-c1ccncc1
Show InChI InChI=1S/C13H13N3O/c17-13-10-8-12(9-3-6-14-7-4-9)16-11(10)2-1-5-15-13/h3-4,6-8,16H,1-2,5H2,(H,15,17)
Reactome pathway
n/an/a 158n/an/an/an/a7.925
Nerviano Medical Sciences Srl
Assay Description
The potency of the compound toward kinase activity was determined using a Dowex resin-based assay. The substrate was phosphorylated by kinase in the ...
J Med Chem 51: 487-501 (2008)
Article DOI: 10.1021/jm700956r
BindingDB Entry DOI: 10.7270/Q247485B