BDBM27404 2-(2-aminopyrimidin-4-yl)-1-ethyl-1H,4H,5H,6H,7H-pyrrolo[3,2-c]pyridin-4-one::pyrrolopyridinone scaffold, 26
SMILES: CCn1c2CCNC(=O)c2cc1-c1ccnc(N)n1
InChI Key: InChIKey=YUZZQQUJSVHICK-UHFFFAOYSA-N
Data: 1 IC50
Activity Spreadsheet -- Enzyme Inhibition Constant Data from BindingDB
Found 1 hit for monomerid = 27404
Trg + Lig
Ki
nM
ΔG°
kcal/mole
IC50
nM
Kd
nM
EC50/IC50
nM
koff
s-1
kon
M-1s-1
pHTemp
°C
Cdc7 Kinase
(Homo sapiens (Human))
BDBM27404
(2-(2-aminopyrimidin-4-yl)-1-ethyl-1H,4H,5H,6H,7H-p...)
Show SMILES CCn1c2CCNC(=O)c2cc1-c1ccnc(N)n1
Show InChI InChI=1S/C13H15N5O/c1-2-18-10-4-6-15-12(19)8(10)7-11(18)9-3-5-16-13(14)17-9/h3,5,7H,2,4,6H2,1H3,(H,15,19)(H2,14,16,17)
Reactome pathway
n/an/a 8n/an/an/an/a7.925
Nerviano Medical Sciences Srl
Assay Description
The potency of the compound toward kinase activity was determined using a Dowex resin-based assay. The substrate was phosphorylated by kinase in the ...
J Med Chem 51: 487-501 (2008)
Article DOI: 10.1021/jm700956r
BindingDB Entry DOI: 10.7270/Q247485B