BDBM27411 2-(2-aminopyrimidin-4-yl)-1-(2-methylpropyl)-1H,4H,5H,6H,7H-pyrrolo[3,2-c]pyridin-4-one::pyrrolopyridinone scaffold, 33
SMILES: CC(C)Cn1c2CCNC(=O)c2cc1-c1ccnc(N)n1
InChI Key: InChIKey=YUCNNNHQRCUECN-UHFFFAOYSA-N
Data: 1 IC50
Activity Spreadsheet -- Enzyme Inhibition Constant Data from BindingDB
Found 1 hit for monomerid = 27411
Trg + Lig
Ki
nM
ΔG°
kcal/mole
IC50
nM
Kd
nM
EC50/IC50
nM
koff
s-1
kon
M-1s-1
pHTemp
°C
Cdc7 Kinase
(Homo sapiens (Human))
BDBM27411
(2-(2-aminopyrimidin-4-yl)-1-(2-methylpropyl)-1H,4H...)
Show SMILES CC(C)Cn1c2CCNC(=O)c2cc1-c1ccnc(N)n1
Show InChI InChI=1S/C15H19N5O/c1-9(2)8-20-12-4-6-17-14(21)10(12)7-13(20)11-3-5-18-15(16)19-11/h3,5,7,9H,4,6,8H2,1-2H3,(H,17,21)(H2,16,18,19)
Reactome pathway
n/an/a 13n/an/an/an/an/an/a
Nerviano Medical Sciences Srl
Assay Description
The potency of the compound toward kinase activity was determined using a Dowex resin-based assay. The substrate was phosphorylated by kinase in the ...
J Med Chem 51: 487-501 (2008)
Article DOI: 10.1021/jm700956r
BindingDB Entry DOI: 10.7270/Q247485B