BDBM27416 2-(2-aminopyrimidin-4-yl)-1-phenyl-1H,4H,5H,6H,7H-pyrrolo[3,2-c]pyridin-4-one::pyrrolopyridinone scaffold, 38
SMILES: Nc1nccc(n1)-c1cc2c(CCNC2=O)n1-c1ccccc1
InChI Key: InChIKey=UDXMXAGSJLKOGP-UHFFFAOYSA-N
Data: 1 IC50
Activity Spreadsheet -- Enzyme Inhibition Constant Data from BindingDB
Found 1 hit for monomerid = 27416
Trg + Lig
Ki
nM
ΔG°
kcal/mole
IC50
nM
Kd
nM
EC50/IC50
nM
koff
s-1
kon
M-1s-1
pHTemp
°C
Cdc7 Kinase
(Homo sapiens (Human))
BDBM27416
(2-(2-aminopyrimidin-4-yl)-1-phenyl-1H,4H,5H,6H,7H-...)
Show SMILES Nc1nccc(n1)-c1cc2c(CCNC2=O)n1-c1ccccc1
Show InChI InChI=1S/C17H15N5O/c18-17-20-8-6-13(21-17)15-10-12-14(7-9-19-16(12)23)22(15)11-4-2-1-3-5-11/h1-6,8,10H,7,9H2,(H,19,23)(H2,18,20,21)
Reactome pathway
n/an/a>5.00E+3n/an/an/an/an/an/a
Nerviano Medical Sciences Srl
Assay Description
The potency of the compound toward kinase activity was determined using a Dowex resin-based assay. The substrate was phosphorylated by kinase in the ...
J Med Chem 51: 487-501 (2008)
Article DOI: 10.1021/jm700956r
BindingDB Entry DOI: 10.7270/Q247485B