BDBM274503 2-fluoro-N-(6-(4-(4-fluorophenyl)-1-(1- (isothiazole-5-carbonyl)piperidin-4-yl)- 1H-imidazol-5-yl)imidazo[1,2- b]pyridazin-2-yl)isonicotinamide::US9556179, Compound 73
SMILES: Fc1ccc(cc1)-c1ncn(C2CCN(CC2)C(=O)c2ccns2)c1-c1ccc2nc(NC(=O)c3ccnc(F)c3)cn2n1
InChI Key: InChIKey=XIAYODYRHGGLGJ-UHFFFAOYSA-N
Data: 2 IC50
Activity Spreadsheet -- Enzyme Inhibition Constant Data from BindingDB
Found 2 hits for monomerid = 274503
Trg + Lig
Ki
nM
ΔG°
kcal/mole
IC50
nM
Kd
nM
EC50/IC50
nM
koff
s-1
kon
M-1s-1
pHTemp
°C
Casein kinase I isoform delta
(Homo sapiens (Human))
BDBM274503
(2-fluoro-N-(6-(4-(4-fluorophenyl)-1-(1- (isothiazo...)
Show SMILES Fc1ccc(cc1)-c1ncn(C2CCN(CC2)C(=O)c2ccns2)c1-c1ccc2nc(NC(=O)c3ccnc(F)c3)cn2n1
Show InChI InChI=1S/C30H23F2N9O2S/c31-20-3-1-18(2-4-20)27-28(40(17-34-27)21-9-13-39(14-10-21)30(43)23-8-12-35-44-23)22-5-6-26-36-25(16-41(26)38-22)37-29(42)19-7-11-33-24(32)15-19/h1-8,11-12,15-17,21H,9-10,13-14H2,(H,37,42)
US Patent
n/an/a 0.354n/an/an/an/a7.425
Bristol-Myers Squibb Company
US Patent
Assay Description
The kinase assay was performed in V-bottom 384-well plates. The final assay volume was 30 μl prepared from 15 μl additions of enzyme, subst...
US Patent US9556179 (2017)
BindingDB Entry DOI: 10.7270/Q2G73GR5
Casein kinase I isoform epsilon
(Homo sapiens (Human))
BDBM274503
(2-fluoro-N-(6-(4-(4-fluorophenyl)-1-(1- (isothiazo...)
Show SMILES Fc1ccc(cc1)-c1ncn(C2CCN(CC2)C(=O)c2ccns2)c1-c1ccc2nc(NC(=O)c3ccnc(F)c3)cn2n1
Show InChI InChI=1S/C30H23F2N9O2S/c31-20-3-1-18(2-4-20)27-28(40(17-34-27)21-9-13-39(14-10-21)30(43)23-8-12-35-44-23)22-5-6-26-36-25(16-41(26)38-22)37-29(42)19-7-11-33-24(32)15-19/h1-8,11-12,15-17,21H,9-10,13-14H2,(H,37,42)
US Patent
n/an/a 0.608n/an/an/an/a7.425
Bristol-Myers Squibb Company
US Patent
Assay Description
The kinase assay was performed in V-bottom 384-well plates. The final assay volume was 30 μl prepared from 15 μl additions of enzyme, subst...
US Patent US9556179 (2017)
BindingDB Entry DOI: 10.7270/Q2G73GR5