BDBM275463 US9879013, 8
SMILES: Nc1ncnc2n(C3CN(C3)C(=O)C=C)c(=O)n(-c3ccc(Oc4ccccc4)cc3)c12
InChI Key: InChIKey=JDJIUBQAXIUQGA-UHFFFAOYSA-N
Data: 3 IC50
Activity Spreadsheet -- Enzyme Inhibition Constant Data from BindingDB
Found 3 hits for monomerid = 275463
Trg + Lig
Ki
nM
ΔG°
kcal/mole
IC50
nM
Kd
nM
EC50/IC50
nM
koff
s-1
kon
M-1s-1
pHTemp
°C
LCK/BTK
(Homo sapiens (Human))
BDBM275463
(US9879013, 8)
Show SMILES Nc1ncnc2n(C3CN(C3)C(=O)C=C)c(=O)n(-c3ccc(Oc4ccccc4)cc3)c12
Show InChI InChI=1S/C23H20N6O3/c1-2-19(30)27-12-16(13-27)29-22-20(21(24)25-14-26-22)28(23(29)31)15-8-10-18(11-9-15)32-17-6-4-3-5-7-17/h2-11,14,16H,1,12-13H2,(H2,24,25,26)
US Patent
n/an/a 8.00E+4n/an/an/an/an/an/a
ONO PHARMACEUTICAL CO., LTD.
US Patent
Assay Description
The Btk enzyme inhibitory activity was measured, based on the protocol provided by the manufacturer, using Btk (Invitrogen Corporation) and the ZR...
US Patent US9879013 (2018)
BindingDB Entry DOI: 10.7270/Q2X63PZ1
LynA/BTK
(Homo sapiens (Human))
BDBM275463
(US9879013, 8)
Show SMILES Nc1ncnc2n(C3CN(C3)C(=O)C=C)c(=O)n(-c3ccc(Oc4ccccc4)cc3)c12
Show InChI InChI=1S/C23H20N6O3/c1-2-19(30)27-12-16(13-27)29-22-20(21(24)25-14-26-22)28(23(29)31)15-8-10-18(11-9-15)32-17-6-4-3-5-7-17/h2-11,14,16H,1,12-13H2,(H2,24,25,26)
NCI pathway
Reactome pathway
US Patent
n/an/a 4.59E+5n/an/an/an/an/an/a
ONO PHARMACEUTICAL CO., LTD.
US Patent
Assay Description
The Btk enzyme inhibitory activity was measured, based on the protocol provided by the manufacturer, using Btk (Invitrogen Corporation) and the ZR...
US Patent US9879013 (2018)
BindingDB Entry DOI: 10.7270/Q2X63PZ1
Fyn/BTK
(Homo sapiens (Human))
BDBM275463
(US9879013, 8)
Show SMILES Nc1ncnc2n(C3CN(C3)C(=O)C=C)c(=O)n(-c3ccc(Oc4ccccc4)cc3)c12
Show InChI InChI=1S/C23H20N6O3/c1-2-19(30)27-12-16(13-27)29-22-20(21(24)25-14-26-22)28(23(29)31)15-8-10-18(11-9-15)32-17-6-4-3-5-7-17/h2-11,14,16H,1,12-13H2,(H2,24,25,26)
US Patent
n/an/a 4.53E+5n/an/an/an/an/an/a
ONO PHARMACEUTICAL CO., LTD.
US Patent
Assay Description
The Btk enzyme inhibitory activity was measured, based on the protocol provided by the manufacturer, using Btk (Invitrogen Corporation) and the ZR...
US Patent US9879013 (2018)
BindingDB Entry DOI: 10.7270/Q2X63PZ1