BDBM2755 3,3-Dichloro-4,4-dimethoxy-5,5-bis(methoxycarbonyl)-6,6-diphenyl-5-hexenoic Acid::6,6-bis[3-chloro-4-methoxy-5-(methoxycarbonyl)phenyl]hex-5-enoic acid::Alkenyldiarylmethane (ADAM) 25::Alkenyldiarylmethanes (ADAM) 25
SMILES: [#6]-[#8]-[#6](=O)-c1cc(cc(Cl)c1-[#8]-[#6])-[#6](=[#6]\[#6]-[#6]-[#6]-[#6](-[#8])=O)\c1cc(Cl)c(-[#8]-[#6])c(c1)-[#6](=O)-[#8]-[#6]
InChI Key: InChIKey=PVXVKVRDUPQFMT-UHFFFAOYSA-N
Data: 1 IC50
Activity Spreadsheet -- Enzyme Inhibition Constant Data from BindingDB
Found 1 hit for monomerid = 2755
Trg + Lig
Ki
nM
ΔG°
kcal/mole
IC50
nM
Kd
nM
EC50/IC50
nM
koff
s-1
kon
M-1s-1
pHTemp
°C
HIV-1 Reverse Transcriptase
(Human immunodeficiency virus type 1)
BDBM2755
(3,3-Dichloro-4,4-dimethoxy-5,5-bis(methoxycarbonyl...)
Show SMILES [#6]-[#8]-[#6](=O)-c1cc(cc(Cl)c1-[#8]-[#6])-[#6](=[#6]\[#6]-[#6]-[#6]-[#6](-[#8])=O)\c1cc(Cl)c(-[#8]-[#6])c(c1)-[#6](=O)-[#8]-[#6]
Show InChI InChI=1S/C24H24Cl2O8/c1-31-21-16(23(29)33-3)9-13(11-18(21)25)15(7-5-6-8-20(27)28)14-10-17(24(30)34-4)22(32-2)19(26)12-14/h7,9-12H,5-6,8H2,1-4H3,(H,27,28)
n/an/a>1.00E+5n/an/an/an/a7.9n/a
Purdue University
Assay Description
The IC50 of reverse transcriptase is the concentration that inhibits 50% of recombinant HIV-1 RT RNA-directed DNA polymerase activity in vitro.
J Med Chem 41: 2076-89 (1998)
Article DOI: 10.1021/jm9800595
BindingDB Entry DOI: 10.7270/Q2251GC2