BDBM27569 4-[(4-fluoro-3-{[4-(oxolan-2-ylcarbonyl)piperazin-1-yl]carbonyl}phenyl)methyl]-1,2-dihydrophthalazin-1-one::Acylpiperazine analogue, 50
SMILES: Fc1ccc(Cc2n[nH]c(=O)c3ccccc23)cc1C(=O)N1CCN(CC1)C(=O)C1CCCO1
InChI Key: InChIKey=ZNOCPAABZHOLJK-UHFFFAOYSA-N
Data: 1 IC50
Activity Spreadsheet -- Enzyme Inhibition Constant Data from BindingDB
Found 1 hit for monomerid = 27569
Trg + Lig
Ki
nM
ΔG°
kcal/mole
IC50
nM
Kd
nM
EC50/IC50
nM
koff
s-1
kon
M-1s-1
pHTemp
°C
Poly [ADP-ribose] polymerase 1
(Homo sapiens (Human))
BDBM27569
(4-[(4-fluoro-3-{[4-(oxolan-2-ylcarbonyl)piperazin-...)
Show SMILES Fc1ccc(Cc2n[nH]c(=O)c3ccccc23)cc1C(=O)N1CCN(CC1)C(=O)C1CCCO1
Show InChI InChI=1S/C25H25FN4O4/c26-20-8-7-16(15-21-17-4-1-2-5-18(17)23(31)28-27-21)14-19(20)24(32)29-9-11-30(12-10-29)25(33)22-6-3-13-34-22/h1-2,4-5,7-8,14,22H,3,6,9-13,15H2,(H,28,31)
n/an/a 3n/an/an/an/an/an/a
KuDOS Pharmaceuticals Ltd.
Assay Description
A FlashPlate scintillation proximity assay has been developed to identify inhibitors of PARP-1. The mechanism of action of the assay requires the bin...
J Med Chem 51: 6581-91 (2008)
Article DOI: 10.1021/jm8001263
BindingDB Entry DOI: 10.7270/Q2BP014T