BDBM276075 2-[1-(2-naphthalen-1-ylethyl)imidazol-4-yl]-4-[5-(trifluoromethyl)-1H-triazol-4-yl]pyridine::US10071984, Example 37::US10174003, Example 37::US9896436, Example 37
SMILES: FC(F)(F)c1[nH]nnc1-c1ccnc(c1)-c1cn(CCc2cccc3ccccc23)cn1
InChI Key: InChIKey=LFTNYCKBUCFJFQ-UHFFFAOYSA-N
Data: 6 IC50
Activity Spreadsheet -- Enzyme Inhibition Constant Data from BindingDB
Found 6 hits for monomerid = 276075
Trg + Lig
Ki
nM
ΔG°
kcal/mole
IC50
nM
Kd
nM
EC50/IC50
nM
koff
s-1
kon
M-1s-1
pHTemp
°C
Lysine-specific demethylase 2B
(Homo sapiens (Human))
BDBM276075
(2-[1-(2-naphthalen-1-ylethyl)imidazol-4-yl]-4-[5-(...)
Show SMILES FC(F)(F)c1[nH]nnc1-c1ccnc(c1)-c1cn(CCc2cccc3ccccc23)cn1
Show InChI InChI=1S/C23H17F3N6/c24-23(25,26)22-21(29-31-30-22)17-8-10-27-19(12-17)20-13-32(14-28-20)11-9-16-6-3-5-15-4-1-2-7-18(15)16/h1-8,10,12-14H,9,11H2,(H,29,30,31)
US Patent
n/an/a<100n/an/an/an/an/a25
Celgene Quanticel Research, Inc.
US Patent
Assay Description
The ability of test compounds to inhibit the activity of FBXL10 was determined in 384-well plate format under the following reaction conditions: 0.3 ...
US Patent US10071984 (2018)
BindingDB Entry DOI: 10.7270/Q24Q7X0X
histone lysine demethylase PHF8 isoform 2
(Homo sapiens (Human))
BDBM276075
(2-[1-(2-naphthalen-1-ylethyl)imidazol-4-yl]-4-[5-(...)
Show SMILES FC(F)(F)c1[nH]nnc1-c1ccnc(c1)-c1cn(CCc2cccc3ccccc23)cn1
Show InChI InChI=1S/C23H17F3N6/c24-23(25,26)22-21(29-31-30-22)17-8-10-27-19(12-17)20-13-32(14-28-20)11-9-16-6-3-5-15-4-1-2-7-18(15)16/h1-8,10,12-14H,9,11H2,(H,29,30,31)
US Patent
n/an/a>1.00E+4n/an/an/an/an/a25
Celgene Quanticel Research, Inc.
US Patent
Assay Description
The ability of test compounds to inhibit the activity of PHF8 was determined in 384-well plate format under the following reaction conditions: 3 nM P...
US Patent US10071984 (2018)
BindingDB Entry DOI: 10.7270/Q24Q7X0X
Histone lysine demethylase PHF8
(Homo sapiens (Human))
BDBM276075
(2-[1-(2-naphthalen-1-ylethyl)imidazol-4-yl]-4-[5-(...)
Show SMILES FC(F)(F)c1[nH]nnc1-c1ccnc(c1)-c1cn(CCc2cccc3ccccc23)cn1
Show InChI InChI=1S/C23H17F3N6/c24-23(25,26)22-21(29-31-30-22)17-8-10-27-19(12-17)20-13-32(14-28-20)11-9-16-6-3-5-15-4-1-2-7-18(15)16/h1-8,10,12-14H,9,11H2,(H,29,30,31)
US Patent
n/an/a>1.00E+4n/an/an/an/an/an/a
GSK
Assay Description
PHF8 Assay: The ability of test compounds to inhibit the activity of PHF8 was determined in 384-well plate format under the following reaction condit...
Bioorg Med Chem Lett 17: 1584-9 (2007)
BindingDB Entry DOI: 10.7270/Q2FT8PBQ
Histone lysine demethylase PHF8
(Homo sapiens (Human))
BDBM276075
(2-[1-(2-naphthalen-1-ylethyl)imidazol-4-yl]-4-[5-(...)
Show SMILES FC(F)(F)c1[nH]nnc1-c1ccnc(c1)-c1cn(CCc2cccc3ccccc23)cn1
Show InChI InChI=1S/C23H17F3N6/c24-23(25,26)22-21(29-31-30-22)17-8-10-27-19(12-17)20-13-32(14-28-20)11-9-16-6-3-5-15-4-1-2-7-18(15)16/h1-8,10,12-14H,9,11H2,(H,29,30,31)
US Patent
n/an/a>1.00E+4n/an/an/an/an/an/a
Celgene Quanticel Research, Inc.
US Patent
Assay Description
The ability of test compounds to inhibit the activity of PHF8 was determined in 384-well plate format under the following reaction conditions: 3 nM P...
US Patent US10174003 (2019)
BindingDB Entry DOI: 10.7270/Q2417053
Lysine-specific demethylase 2B
(Homo sapiens (Human))
BDBM276075
(2-[1-(2-naphthalen-1-ylethyl)imidazol-4-yl]-4-[5-(...)
Show SMILES FC(F)(F)c1[nH]nnc1-c1ccnc(c1)-c1cn(CCc2cccc3ccccc23)cn1
Show InChI InChI=1S/C23H17F3N6/c24-23(25,26)22-21(29-31-30-22)17-8-10-27-19(12-17)20-13-32(14-28-20)11-9-16-6-3-5-15-4-1-2-7-18(15)16/h1-8,10,12-14H,9,11H2,(H,29,30,31)
US Patent
n/an/a<100n/an/an/an/an/an/a
GSK
Assay Description
The ability of test compounds to inhibit the activity of FBXL10 was determined in 384-well plate format under the following reaction conditions: 0.3 ...
Bioorg Med Chem Lett 17: 1584-9 (2007)
BindingDB Entry DOI: 10.7270/Q2FT8PBQ
Lysine-specific demethylase 2B
(Homo sapiens (Human))
BDBM276075
(2-[1-(2-naphthalen-1-ylethyl)imidazol-4-yl]-4-[5-(...)
Show SMILES FC(F)(F)c1[nH]nnc1-c1ccnc(c1)-c1cn(CCc2cccc3ccccc23)cn1
Show InChI InChI=1S/C23H17F3N6/c24-23(25,26)22-21(29-31-30-22)17-8-10-27-19(12-17)20-13-32(14-28-20)11-9-16-6-3-5-15-4-1-2-7-18(15)16/h1-8,10,12-14H,9,11H2,(H,29,30,31)
US Patent
n/an/a<100n/an/an/an/an/an/a
Celgene Quanticel Research, Inc.
US Patent
Assay Description
The ability of test compounds to inhibit the activity of FBXL10 was determined in 384-well plate format under the following reaction conditions: 0.3 ...
US Patent US10174003 (2019)
BindingDB Entry DOI: 10.7270/Q2417053