BDBM276080 1-(cyclopropylmethyl)-4-{1H-[1,2,3]triazolo[4,5-c]pyridin-6-yl}-1H-imidazole::US10071984, Example 42::US10174003, Example 42::US9896436, Example 42
SMILES: C(C1CC1)n1cnc(c1)-c1cc2[nH]nnc2cn1
InChI Key: InChIKey=JKQLIDDJQPWZHO-UHFFFAOYSA-N
Data: 6 IC50
Activity Spreadsheet -- Enzyme Inhibition Constant Data from BindingDB
Found 6 hits for monomerid = 276080
Trg + Lig
Ki
nM
ΔG°
kcal/mole
IC50
nM
Kd
nM
EC50/IC50
nM
koff
s-1
kon
M-1s-1
pHTemp
°C
Lysine-specific demethylase 2B
(Homo sapiens (Human))
BDBM276080
(1-(cyclopropylmethyl)-4-{1H-[1,2,3]triazolo[4,5-c]...)
Show SMILES C(C1CC1)n1cnc(c1)-c1cc2[nH]nnc2cn1
Show InChI InChI=1S/C12H12N6/c1-2-8(1)5-18-6-12(14-7-18)9-3-10-11(4-13-9)16-17-15-10/h3-4,6-8H,1-2,5H2,(H,15,16,17)
US Patent
n/an/a<100n/an/an/an/an/a25
Celgene Quanticel Research, Inc.
US Patent
Assay Description
The ability of test compounds to inhibit the activity of FBXL10 was determined in 384-well plate format under the following reaction conditions: 0.3 ...
US Patent US10071984 (2018)
BindingDB Entry DOI: 10.7270/Q24Q7X0X
histone lysine demethylase PHF8 isoform 2
(Homo sapiens (Human))
BDBM276080
(1-(cyclopropylmethyl)-4-{1H-[1,2,3]triazolo[4,5-c]...)
Show SMILES C(C1CC1)n1cnc(c1)-c1cc2[nH]nnc2cn1
Show InChI InChI=1S/C12H12N6/c1-2-8(1)5-18-6-12(14-7-18)9-3-10-11(4-13-9)16-17-15-10/h3-4,6-8H,1-2,5H2,(H,15,16,17)
US Patent
n/an/a 5.50E+3n/an/an/an/an/a25
Celgene Quanticel Research, Inc.
US Patent
Assay Description
The ability of test compounds to inhibit the activity of PHF8 was determined in 384-well plate format under the following reaction conditions: 3 nM P...
US Patent US10071984 (2018)
BindingDB Entry DOI: 10.7270/Q24Q7X0X
Histone lysine demethylase PHF8
(Homo sapiens (Human))
BDBM276080
(1-(cyclopropylmethyl)-4-{1H-[1,2,3]triazolo[4,5-c]...)
Show SMILES C(C1CC1)n1cnc(c1)-c1cc2[nH]nnc2cn1
Show InChI InChI=1S/C12H12N6/c1-2-8(1)5-18-6-12(14-7-18)9-3-10-11(4-13-9)16-17-15-10/h3-4,6-8H,1-2,5H2,(H,15,16,17)
US Patent
n/an/a>500n/an/an/an/an/an/a
GSK
Assay Description
PHF8 Assay: The ability of test compounds to inhibit the activity of PHF8 was determined in 384-well plate format under the following reaction condit...
Bioorg Med Chem Lett 17: 1584-9 (2007)
BindingDB Entry DOI: 10.7270/Q2FT8PBQ
Histone lysine demethylase PHF8
(Homo sapiens (Human))
BDBM276080
(1-(cyclopropylmethyl)-4-{1H-[1,2,3]triazolo[4,5-c]...)
Show SMILES C(C1CC1)n1cnc(c1)-c1cc2[nH]nnc2cn1
Show InChI InChI=1S/C12H12N6/c1-2-8(1)5-18-6-12(14-7-18)9-3-10-11(4-13-9)16-17-15-10/h3-4,6-8H,1-2,5H2,(H,15,16,17)
US Patent
n/an/a 5.50E+3n/an/an/an/an/an/a
Celgene Quanticel Research, Inc.
US Patent
Assay Description
The ability of test compounds to inhibit the activity of PHF8 was determined in 384-well plate format under the following reaction conditions: 3 nM P...
US Patent US10174003 (2019)
BindingDB Entry DOI: 10.7270/Q2417053
Lysine-specific demethylase 2B
(Homo sapiens (Human))
BDBM276080
(1-(cyclopropylmethyl)-4-{1H-[1,2,3]triazolo[4,5-c]...)
Show SMILES C(C1CC1)n1cnc(c1)-c1cc2[nH]nnc2cn1
Show InChI InChI=1S/C12H12N6/c1-2-8(1)5-18-6-12(14-7-18)9-3-10-11(4-13-9)16-17-15-10/h3-4,6-8H,1-2,5H2,(H,15,16,17)
US Patent
n/an/a<100n/an/an/an/an/an/a
GSK
Assay Description
The ability of test compounds to inhibit the activity of FBXL10 was determined in 384-well plate format under the following reaction conditions: 0.3 ...
Bioorg Med Chem Lett 17: 1584-9 (2007)
BindingDB Entry DOI: 10.7270/Q2FT8PBQ
Lysine-specific demethylase 2B
(Homo sapiens (Human))
BDBM276080
(1-(cyclopropylmethyl)-4-{1H-[1,2,3]triazolo[4,5-c]...)
Show SMILES C(C1CC1)n1cnc(c1)-c1cc2[nH]nnc2cn1
Show InChI InChI=1S/C12H12N6/c1-2-8(1)5-18-6-12(14-7-18)9-3-10-11(4-13-9)16-17-15-10/h3-4,6-8H,1-2,5H2,(H,15,16,17)
US Patent
n/an/a<100n/an/an/an/an/an/a
Celgene Quanticel Research, Inc.
US Patent
Assay Description
The ability of test compounds to inhibit the activity of FBXL10 was determined in 384-well plate format under the following reaction conditions: 0.3 ...
US Patent US10174003 (2019)
BindingDB Entry DOI: 10.7270/Q2417053