null
SMILES: Clc1cc(Cl)cc(c1)-n1cnc(c1)-c1cc2[nH]nnc2cn1
InChI Key: InChIKey=PXBUOEOSFSTIDA-UHFFFAOYSA-N
Activity Spreadsheet -- Enzyme Inhibition Constant Data from BindingDB
Found 6 hits for monomerid = 276090
Trg + Lig
Ki
nM
ΔG°
kcal/mole
IC50
nM
Kd
nM
EC50/IC50
nM
koff
s-1
kon
M-1s-1
pHTemp
°C
Lysine-specific demethylase 2B
(Homo sapiens (Human))
BDBM276090
(1-(3,5-dichlorophenyl)-4-{1H-[1,2,3]triazolo[4,5-c...)
Show SMILES Clc1cc(Cl)cc(c1)-n1cnc(c1)-c1cc2[nH]nnc2cn1
Show InChI InChI=1S/C14H8Cl2N6/c15-8-1-9(16)3-10(2-8)22-6-14(18-7-22)11-4-12-13(5-17-11)20-21-19-12/h1-7H,(H,19,20,21)
US Patent
n/an/a 550n/an/an/an/an/a25
Celgene Quanticel Research, Inc.
US Patent
Assay Description
The ability of test compounds to inhibit the activity of FBXL10 was determined in 384-well plate format under the following reaction conditions: 0.3 ...
US Patent US10071984 (2018)
BindingDB Entry DOI: 10.7270/Q24Q7X0X
Isoform 2 of Histone lysine demethylase PHF8 (2)
(Homo sapiens (Human))
BDBM276090
(1-(3,5-dichlorophenyl)-4-{1H-[1,2,3]triazolo[4,5-c...)
Show SMILES Clc1cc(Cl)cc(c1)-n1cnc(c1)-c1cc2[nH]nnc2cn1
Show InChI InChI=1S/C14H8Cl2N6/c15-8-1-9(16)3-10(2-8)22-6-14(18-7-22)11-4-12-13(5-17-11)20-21-19-12/h1-7H,(H,19,20,21)
US Patent
n/an/a 5.50E+3n/an/an/an/an/a25
Celgene Quanticel Research, Inc.
US Patent
Assay Description
The ability of test compounds to inhibit the activity of PHF8 was determined in 384-well plate format under the following reaction conditions: 3 nM P...
US Patent US10071984 (2018)
BindingDB Entry DOI: 10.7270/Q24Q7X0X
Histone lysine demethylase PHF8
(Homo sapiens (Human))
BDBM276090
(1-(3,5-dichlorophenyl)-4-{1H-[1,2,3]triazolo[4,5-c...)
Show SMILES Clc1cc(Cl)cc(c1)-n1cnc(c1)-c1cc2[nH]nnc2cn1
Show InChI InChI=1S/C14H8Cl2N6/c15-8-1-9(16)3-10(2-8)22-6-14(18-7-22)11-4-12-13(5-17-11)20-21-19-12/h1-7H,(H,19,20,21)
US Patent
n/an/a>500n/an/an/an/an/an/a
GSK
Assay Description
PHF8 Assay: The ability of test compounds to inhibit the activity of PHF8 was determined in 384-well plate format under the following reaction condit...
Bioorg Med Chem Lett 17: 1584-9 (2007)
BindingDB Entry DOI: 10.7270/Q2FT8PBQ
Histone lysine demethylase PHF8
(Homo sapiens (Human))
BDBM276090
(1-(3,5-dichlorophenyl)-4-{1H-[1,2,3]triazolo[4,5-c...)
Show SMILES Clc1cc(Cl)cc(c1)-n1cnc(c1)-c1cc2[nH]nnc2cn1
Show InChI InChI=1S/C14H8Cl2N6/c15-8-1-9(16)3-10(2-8)22-6-14(18-7-22)11-4-12-13(5-17-11)20-21-19-12/h1-7H,(H,19,20,21)
US Patent
n/an/a 5.50E+3n/an/an/an/an/an/a
Celgene Quanticel Research, Inc.
US Patent
Assay Description
The ability of test compounds to inhibit the activity of PHF8 was determined in 384-well plate format under the following reaction conditions: 3 nM P...
US Patent US10174003 (2019)
BindingDB Entry DOI: 10.7270/Q2417053
Lysine-specific demethylase 2B
(Homo sapiens (Human))
BDBM276090
(1-(3,5-dichlorophenyl)-4-{1H-[1,2,3]triazolo[4,5-c...)
Show SMILES Clc1cc(Cl)cc(c1)-n1cnc(c1)-c1cc2[nH]nnc2cn1
Show InChI InChI=1S/C14H8Cl2N6/c15-8-1-9(16)3-10(2-8)22-6-14(18-7-22)11-4-12-13(5-17-11)20-21-19-12/h1-7H,(H,19,20,21)
US Patent
n/an/a 300n/an/an/an/an/an/a
GSK
Assay Description
The ability of test compounds to inhibit the activity of FBXL10 was determined in 384-well plate format under the following reaction conditions: 0.3 ...
Bioorg Med Chem Lett 17: 1584-9 (2007)
BindingDB Entry DOI: 10.7270/Q2FT8PBQ
Lysine-specific demethylase 2B
(Homo sapiens (Human))
BDBM276090
(1-(3,5-dichlorophenyl)-4-{1H-[1,2,3]triazolo[4,5-c...)
Show SMILES Clc1cc(Cl)cc(c1)-n1cnc(c1)-c1cc2[nH]nnc2cn1
Show InChI InChI=1S/C14H8Cl2N6/c15-8-1-9(16)3-10(2-8)22-6-14(18-7-22)11-4-12-13(5-17-11)20-21-19-12/h1-7H,(H,19,20,21)
US Patent
n/an/a 550n/an/an/an/an/an/a
Celgene Quanticel Research, Inc.
US Patent
Assay Description
The ability of test compounds to inhibit the activity of FBXL10 was determined in 384-well plate format under the following reaction conditions: 0.3 ...
US Patent US10174003 (2019)
BindingDB Entry DOI: 10.7270/Q2417053