BDBM276133 2-[[1-(3-Bromo-4-fluoro-phenyl)triazol-4-yl]methoxy]-5-ethyl-::US10071988, Example 40::US10233173, Example 40
SMILES: CCc1cnc(OCc2cn(nn2)-c2ccc(F)c(Br)c2)nc1
InChI Key: InChIKey=ZANMWPGPVSXQRZ-UHFFFAOYSA-N
Data: 2 IC50
Activity Spreadsheet -- Enzyme Inhibition Constant Data from BindingDB
Found 2 hits for monomerid = 276133
Trg + Lig
Ki
nM
ΔG°
kcal/mole
IC50
nM
Kd
nM
EC50/IC50
nM
koff
s-1
kon
M-1s-1
pHTemp
°C
GluN1/GluN2B NMDA receptor
(Homo sapiens (Human))
BDBM276133
(2-[[1-(3-Bromo-4-fluoro-phenyl)triazol-4-yl]methox...)
Show SMILES CCc1cnc(OCc2cn(nn2)-c2ccc(F)c(Br)c2)nc1
Show InChI InChI=1S/C15H13BrFN5O/c1-2-10-6-18-15(19-7-10)23-9-11-8-22(21-20-11)12-3-4-14(17)13(16)5-12/h3-8H,2,9H2,1H3
NCI pathway
Reactome pathway
US Patent
n/an/a 1n/an/an/an/an/an/a
Lund University
Assay Description
NMDA receptors are ion channels that are highly permeable to Ca2+ ions, rendering it possible to monitor NMDA receptor function using cell-based calc...
Bioorg Med Chem 14: 1215-20 (2006)
BindingDB Entry DOI: 10.7270/Q23R0W6K
Retinoic acid receptor RXR-alpha
(Homo sapiens (Human))
BDBM276133
(2-[[1-(3-Bromo-4-fluoro-phenyl)triazol-4-yl]methox...)
Show SMILES CCc1cnc(OCc2cn(nn2)-c2ccc(F)c(Br)c2)nc1
Show InChI InChI=1S/C15H13BrFN5O/c1-2-10-6-18-15(19-7-10)23-9-11-8-22(21-20-11)12-3-4-14(17)13(16)5-12/h3-8H,2,9H2,1H3
NCI pathway
Reactome pathway
US Patent
n/an/a 1n/an/an/an/a7.425
JANSSEN PHARMACEUTICA NV
US Patent
Assay Description
NMDA receptors are ion channels that are highly permeable to Ca2+ ions, rendering it possible to monitor NMDA receptor function using cell-based calc...
US Patent US10071988 (2018)
BindingDB Entry DOI: 10.7270/Q20Z7591