BDBM276144 2-[[1-[3-(Difluoromethyl)-4-fluoro-phenyl]triazol-4-yl]methoxy]-5-::US10071988, Example 51::US10233173, Example 51
SMILES: Cc1cnc(OCc2cn(nn2)-c2ccc(F)c(c2)C(F)F)nc1
InChI Key: InChIKey=HOYXXXFMZLRNFX-UHFFFAOYSA-N
Data: 2 IC50
Activity Spreadsheet -- Enzyme Inhibition Constant Data from BindingDB
Found 2 hits for monomerid = 276144
Trg + Lig
Ki
nM
ΔG°
kcal/mole
IC50
nM
Kd
nM
EC50/IC50
nM
koff
s-1
kon
M-1s-1
pHTemp
°C
GluN1/GluN2B NMDA receptor
(Homo sapiens (Human))
BDBM276144
(2-[[1-[3-(Difluoromethyl)-4-fluoro-phenyl]triazol-...)
Show SMILES Cc1cnc(OCc2cn(nn2)-c2ccc(F)c(c2)C(F)F)nc1
Show InChI InChI=1S/C15H12F3N5O/c1-9-5-19-15(20-6-9)24-8-10-7-23(22-21-10)11-2-3-13(16)12(4-11)14(17)18/h2-7,14H,8H2,1H3
NCI pathway
Reactome pathway
US Patent
n/an/a 1n/an/an/an/an/an/a
Lund University
Assay Description
NMDA receptors are ion channels that are highly permeable to Ca2+ ions, rendering it possible to monitor NMDA receptor function using cell-based calc...
Bioorg Med Chem 14: 1215-20 (2006)
BindingDB Entry DOI: 10.7270/Q23R0W6K
Retinoic acid receptor RXR-alpha
(Homo sapiens (Human))
BDBM276144
(2-[[1-[3-(Difluoromethyl)-4-fluoro-phenyl]triazol-...)
Show SMILES Cc1cnc(OCc2cn(nn2)-c2ccc(F)c(c2)C(F)F)nc1
Show InChI InChI=1S/C15H12F3N5O/c1-9-5-19-15(20-6-9)24-8-10-7-23(22-21-10)11-2-3-13(16)12(4-11)14(17)18/h2-7,14H,8H2,1H3
NCI pathway
Reactome pathway
US Patent
n/an/a 1n/an/an/an/a7.425
JANSSEN PHARMACEUTICA NV
US Patent
Assay Description
NMDA receptors are ion channels that are highly permeable to Ca2+ ions, rendering it possible to monitor NMDA receptor function using cell-based calc...
US Patent US10071988 (2018)
BindingDB Entry DOI: 10.7270/Q20Z7591