BDBM276154 5-Chloro-2-[[1-[3-(difluoromethoxy)-4-fluoro-phenyl]triazol-4-::US10071988, Example 61::US10233173, Example 61
SMILES: FC(F)Oc1cc(ccc1F)-n1cc(COc2ncc(Cl)cn2)nn1
InChI Key: InChIKey=FISINIFSVFFLDR-UHFFFAOYSA-N
Data: 2 IC50
Activity Spreadsheet -- Enzyme Inhibition Constant Data from BindingDB
Found 2 hits for monomerid = 276154
Trg + Lig
Ki
nM
ΔG°
kcal/mole
IC50
nM
Kd
nM
EC50/IC50
nM
koff
s-1
kon
M-1s-1
pHTemp
°C
GluN1/GluN2B NMDA receptor
(Homo sapiens (Human))
BDBM276154
(5-Chloro-2-[[1-[3-(difluoromethoxy)-4-fluoro-pheny...)
Show SMILES FC(F)Oc1cc(ccc1F)-n1cc(COc2ncc(Cl)cn2)nn1
Show InChI InChI=1S/C14H9ClF3N5O2/c15-8-4-19-14(20-5-8)24-7-9-6-23(22-21-9)10-1-2-11(16)12(3-10)25-13(17)18/h1-6,13H,7H2
NCI pathway
Reactome pathway
US Patent
n/an/a 3n/an/an/an/an/an/a
Lund University
Assay Description
NMDA receptors are ion channels that are highly permeable to Ca2+ ions, rendering it possible to monitor NMDA receptor function using cell-based calc...
Bioorg Med Chem 14: 1215-20 (2006)
BindingDB Entry DOI: 10.7270/Q23R0W6K
Retinoic acid receptor RXR-alpha
(Homo sapiens (Human))
BDBM276154
(5-Chloro-2-[[1-[3-(difluoromethoxy)-4-fluoro-pheny...)
Show SMILES FC(F)Oc1cc(ccc1F)-n1cc(COc2ncc(Cl)cn2)nn1
Show InChI InChI=1S/C14H9ClF3N5O2/c15-8-4-19-14(20-5-8)24-7-9-6-23(22-21-9)10-1-2-11(16)12(3-10)25-13(17)18/h1-6,13H,7H2
NCI pathway
Reactome pathway
US Patent
n/an/a 3n/an/an/an/a7.425
JANSSEN PHARMACEUTICA NV
US Patent
Assay Description
NMDA receptors are ion channels that are highly permeable to Ca2+ ions, rendering it possible to monitor NMDA receptor function using cell-based calc...
US Patent US10071988 (2018)
BindingDB Entry DOI: 10.7270/Q20Z7591