null
SMILES: Fc1c(Cc2n[nH]c3nnccc23)ccc(Cl)c1Oc1cc(Cl)cc(c1)C#N
InChI Key: InChIKey=VUSRPIMIIYIJFV-UHFFFAOYSA-N
Activity Spreadsheet -- Enzyme Inhibition Constant Data from BindingDB
Found 2 hits for monomerid = 27616
Trg + Lig
Ki
nM
ΔG°
kcal/mole
IC50
nM
Kd
nM
EC50/IC50
nM
koff
s-1
kon
M-1s-1
pHTemp
°C
Gag-Pol polyprotein [588-1027,K691N,Y769C]/[588-1147,K691N,Y769C]
(Human immunodeficiency virus type 1)
BDBM27616
(3-chloro-5-(6-chloro-2-fluoro-3-{1H-pyrazolo[3,4-c...)
Show SMILES Fc1c(Cc2n[nH]c3nnccc23)ccc(Cl)c1Oc1cc(Cl)cc(c1)C#N
Show InChI InChI=1S/C19H10Cl2FN5O/c20-12-5-10(9-23)6-13(8-12)28-18-15(21)2-1-11(17(18)22)7-16-14-3-4-24-26-19(14)27-25-16/h1-6,8H,7H2,(H,25,26,27)
n/an/an/an/a 5n/an/a8.030
Roche Palo Alto LLC
Assay Description
IC50s were obtained from the inhibition of the RNA-dependent DNA polymerase activity of the HIV-1 reverse transcriptase enzyme using a primer extensi...
J Med Chem 51: 7449-58 (2008)
Article DOI: 10.1021/jm800527x
BindingDB Entry DOI: 10.7270/Q2TQ5ZV0
Gag-Pol polyprotein [588-1027]
(Human immunodeficiency virus type 1 group M subtyp...)
BDBM27616
(3-chloro-5-(6-chloro-2-fluoro-3-{1H-pyrazolo[3,4-c...)
Show SMILES Fc1c(Cc2n[nH]c3nnccc23)ccc(Cl)c1Oc1cc(Cl)cc(c1)C#N
Show InChI InChI=1S/C19H10Cl2FN5O/c20-12-5-10(9-23)6-13(8-12)28-18-15(21)2-1-11(17(18)22)7-16-14-3-4-24-26-19(14)27-25-16/h1-6,8H,7H2,(H,25,26,27)
n/an/an/an/a 1n/an/a8.030
Roche Palo Alto LLC
Assay Description
IC50s were obtained from the inhibition of the RNA-dependent DNA polymerase activity of the HIV-1 reverse transcriptase enzyme using a primer extensi...
J Med Chem 51: 7449-58 (2008)
Article DOI: 10.1021/jm800527x
BindingDB Entry DOI: 10.7270/Q2TQ5ZV0