null
SMILES: Fc1c(Cc2n[nH]c3nnccc23)ccc(Br)c1Oc1cc(cc(c1)C#N)C#N
InChI Key: InChIKey=VNEYVXJMQOWBHM-UHFFFAOYSA-N
Activity Spreadsheet -- Enzyme Inhibition Constant Data from BindingDB
Found 2 hits for monomerid = 27617
Trg + Lig
Ki
nM
ΔG°
kcal/mole
IC50
nM
Kd
nM
EC50/IC50
nM
koff
s-1
kon
M-1s-1
pHTemp
°C
Gag-Pol polyprotein [588-1027,K691N,Y769C]/[588-1147,K691N,Y769C]
(Human immunodeficiency virus type 1)
BDBM27617
(5-(6-bromo-2-fluoro-3-{1H-pyrazolo[3,4-c]pyridazin...)
Show SMILES Fc1c(Cc2n[nH]c3nnccc23)ccc(Br)c1Oc1cc(cc(c1)C#N)C#N
Show InChI InChI=1S/C20H10BrFN6O/c21-16-2-1-13(8-17-15-3-4-25-27-20(15)28-26-17)18(22)19(16)29-14-6-11(9-23)5-12(7-14)10-24/h1-7H,8H2,(H,26,27,28)
n/an/an/an/a 3n/an/a8.030
Roche Palo Alto LLC
Assay Description
IC50s were obtained from the inhibition of the RNA-dependent DNA polymerase activity of the HIV-1 reverse transcriptase enzyme using a primer extensi...
J Med Chem 51: 7449-58 (2008)
Article DOI: 10.1021/jm800527x
BindingDB Entry DOI: 10.7270/Q2TQ5ZV0
Gag-Pol polyprotein [588-1027]
(Human immunodeficiency virus type 1 group M subtyp...)
BDBM27617
(5-(6-bromo-2-fluoro-3-{1H-pyrazolo[3,4-c]pyridazin...)
Show SMILES Fc1c(Cc2n[nH]c3nnccc23)ccc(Br)c1Oc1cc(cc(c1)C#N)C#N
Show InChI InChI=1S/C20H10BrFN6O/c21-16-2-1-13(8-17-15-3-4-25-27-20(15)28-26-17)18(22)19(16)29-14-6-11(9-23)5-12(7-14)10-24/h1-7H,8H2,(H,26,27,28)
n/an/an/an/a 1n/an/a8.030
Roche Palo Alto LLC
Assay Description
IC50s were obtained from the inhibition of the RNA-dependent DNA polymerase activity of the HIV-1 reverse transcriptase enzyme using a primer extensi...
J Med Chem 51: 7449-58 (2008)
Article DOI: 10.1021/jm800527x
BindingDB Entry DOI: 10.7270/Q2TQ5ZV0