BDBM276467 5-Chloro-2-[[1-[3-(difluoromethyl)-4-fluoro-phenyl]triazol-4-::US10071988, Example 406::US10233173, Example 406
SMILES: Cc1nc(OCc2cn(nn2)-c2ccc(F)c(c2)C(F)F)ncc1Cl
InChI Key: InChIKey=RXLRURYBQIBHOJ-UHFFFAOYSA-N
Data: 2 IC50
Activity Spreadsheet -- Enzyme Inhibition Constant Data from BindingDB
Found 2 hits for monomerid = 276467
Trg + Lig
Ki
nM
ΔG°
kcal/mole
IC50
nM
Kd
nM
EC50/IC50
nM
koff
s-1
kon
M-1s-1
pHTemp
°C
GluN1/GluN2B NMDA receptor
(Homo sapiens (Human))
BDBM276467
(5-Chloro-2-[[1-[3-(difluoromethyl)-4-fluoro-phenyl...)
Show SMILES Cc1nc(OCc2cn(nn2)-c2ccc(F)c(c2)C(F)F)ncc1Cl
Show InChI InChI=1S/C15H11ClF3N5O/c1-8-12(16)5-20-15(21-8)25-7-9-6-24(23-22-9)10-2-3-13(17)11(4-10)14(18)19/h2-6,14H,7H2,1H3
NCI pathway
Reactome pathway
US Patent
n/an/a 1n/an/an/an/an/an/a
Lund University
Assay Description
NMDA receptors are ion channels that are highly permeable to Ca2+ ions, rendering it possible to monitor NMDA receptor function using cell-based calc...
Bioorg Med Chem 14: 1215-20 (2006)
BindingDB Entry DOI: 10.7270/Q23R0W6K
Retinoic acid receptor RXR-alpha
(Homo sapiens (Human))
BDBM276467
(5-Chloro-2-[[1-[3-(difluoromethyl)-4-fluoro-phenyl...)
Show SMILES Cc1nc(OCc2cn(nn2)-c2ccc(F)c(c2)C(F)F)ncc1Cl
Show InChI InChI=1S/C15H11ClF3N5O/c1-8-12(16)5-20-15(21-8)25-7-9-6-24(23-22-9)10-2-3-13(17)11(4-10)14(18)19/h2-6,14H,7H2,1H3
NCI pathway
Reactome pathway
US Patent
n/an/a 1n/an/an/an/a7.425
JANSSEN PHARMACEUTICA NV
US Patent
Assay Description
NMDA receptors are ion channels that are highly permeable to Ca2+ ions, rendering it possible to monitor NMDA receptor function using cell-based calc...
US Patent US10071988 (2018)
BindingDB Entry DOI: 10.7270/Q20Z7591