BDBM27685 2-{4-[(dimethylamino)methyl]phenyl}-3,10-diazatricyclo[6.4.1.0^{4,13}]trideca-1,4(13),5,7-tetraen-9-one::CHEMBL148173::azepino[5,4,3-cd]indol-6-one, 4
SMILES: CN(C)Cc1ccc(cc1)-c1[nH]c2cccc3C(=O)NCCc1c23
InChI Key: InChIKey=SNEIEJXAZHWQSB-UHFFFAOYSA-N
Data: 1 KI  1 IC50
Activity Spreadsheet -- Enzyme Inhibition Constant Data from BindingDB
Found 2 hits for monomerid = 27685
Trg + Lig
Ki
nM
ΔG°
kcal/mole
IC50
nM
Kd
nM
EC50/IC50
nM
koff
s-1
kon
M-1s-1
pHTemp
°C
Poly [ADP-ribose] polymerase 1
(Homo sapiens (Human))
BDBM27685
(2-{4-[(dimethylamino)methyl]phenyl}-3,10-diazatric...)
Show SMILES CN(C)Cc1ccc(cc1)-c1[nH]c2cccc3C(=O)NCCc1c23
Show InChI InChI=1S/C20H21N3O/c1-23(2)12-13-6-8-14(9-7-13)19-15-10-11-21-20(24)16-4-3-5-17(22-19)18(15)16/h3-9,22H,10-12H2,1-2H3,(H,21,24)
5n/an/an/an/an/an/an/an/a
Pfizer Global Research and Development
Curated by ChEMBL
Assay Description
In vitro inhibitory activity towards human poly(ADP-ribose) polymerase 1 (PARP-1).
J Med Chem 45: 4961-74 (2002)
BindingDB Entry DOI: 10.7270/Q2T152ZP
Poly [ADP-ribose] polymerase 1
(Homo sapiens (Human))
BDBM27685
(2-{4-[(dimethylamino)methyl]phenyl}-3,10-diazatric...)
Show SMILES CN(C)Cc1ccc(cc1)-c1[nH]c2cccc3C(=O)NCCc1c23
Show InChI InChI=1S/C20H21N3O/c1-23(2)12-13-6-8-14(9-7-13)19-15-10-11-21-20(24)16-4-3-5-17(22-19)18(15)16/h3-9,22H,10-12H2,1-2H3,(H,21,24)
n/an/a 5n/an/an/an/a8.023
Deltagen Research Laboratories
Assay Description
To assess the inhibitory activity of novel inhibitors, the PARP-1 enzyme assay was carried out in reaction mixture consisting of Escherichia coli str...
Bioorg Med Chem Lett 18: 5126-9 (2008)
Article DOI: 10.1016/j.bmcl.2008.07.091
BindingDB Entry DOI: 10.7270/Q29S1PCX