BDBM276923 US10072001, Example 214::US10259811, Example 214
SMILES: Cc1nc(-c2ccc(OC3CCOCC3)c(c2)C#N)c2nc([nH]c2n1)-c1ccc(cc1)N1CCOCC1
InChI Key: InChIKey=HWPZTINHYQQHHG-UHFFFAOYSA-N
Data: 6 IC50
Activity Spreadsheet -- Enzyme Inhibition Constant Data from BindingDB
Found 6 hits for monomerid = 276923
Trg + Lig
Ki
nM
ΔG°
kcal/mole
IC50
nM
Kd
nM
EC50/IC50
nM
koff
s-1
kon
M-1s-1
pHTemp
°C
Inhibitor of nuclear factor kappa-B kinase subunit epsilon
(Homo sapiens (Human))
BDBM276923
(US10072001, Example 214 | US10259811, Example 214)
Show SMILES Cc1nc(-c2ccc(OC3CCOCC3)c(c2)C#N)c2nc([nH]c2n1)-c1ccc(cc1)N1CCOCC1
Show InChI InChI=1S/C28H28N6O3/c1-18-30-25(20-4-7-24(21(16-20)17-29)37-23-8-12-35-13-9-23)26-28(31-18)33-27(32-26)19-2-5-22(6-3-19)34-10-14-36-15-11-34/h2-7,16,23H,8-15H2,1H3,(H,30,31,32,33)
Reactome pathway
US Patent
n/an/a 4.43n/an/an/an/a7.0n/a
Gilead Sciences, Inc.
US Patent
Assay Description
Enzymatic activity of IKKε and TBK1 was measured using a homogeneous time resolved fluorescence resonance energy transfer (TR-FRET) assay that m...
US Patent US10072001 (2018)
BindingDB Entry DOI: 10.7270/Q27H1MMV
Protein cereblon/Serine/threonine-protein kinase TBK1
(Homo sapiens (Human))
BDBM276923
(US10072001, Example 214 | US10259811, Example 214)
Show SMILES Cc1nc(-c2ccc(OC3CCOCC3)c(c2)C#N)c2nc([nH]c2n1)-c1ccc(cc1)N1CCOCC1
Show InChI InChI=1S/C28H28N6O3/c1-18-30-25(20-4-7-24(21(16-20)17-29)37-23-8-12-35-13-9-23)26-28(31-18)33-27(32-26)19-2-5-22(6-3-19)34-10-14-36-15-11-34/h2-7,16,23H,8-15H2,1H3,(H,30,31,32,33)
US Patent
n/an/a 0.762n/an/an/an/a7.0n/a
Gilead Sciences, Inc.
US Patent
Assay Description
Enzymatic activity of IKKε and TBK1 was measured using a homogeneous time resolved fluorescence resonance energy transfer (TR-FRET) assay that m...
US Patent US10072001 (2018)
BindingDB Entry DOI: 10.7270/Q27H1MMV
Protein cereblon/Serine/threonine-protein kinase TBK1
(Homo sapiens (Human))
BDBM276923
(US10072001, Example 214 | US10259811, Example 214)
Show SMILES Cc1nc(-c2ccc(OC3CCOCC3)c(c2)C#N)c2nc([nH]c2n1)-c1ccc(cc1)N1CCOCC1
Show InChI InChI=1S/C28H28N6O3/c1-18-30-25(20-4-7-24(21(16-20)17-29)37-23-8-12-35-13-9-23)26-28(31-18)33-27(32-26)19-2-5-22(6-3-19)34-10-14-36-15-11-34/h2-7,16,23H,8-15H2,1H3,(H,30,31,32,33)
US Patent
n/an/a>1.00E+3n/an/an/an/an/an/a
University of Tokyo
Assay Description
Enzymatic activity of IKKε and TBK1 was measured using a homogeneous time resolved fluorescence resonance energy transfer (TR-FRET) assay that m...
Bioorg Med Chem 16: 4272-85 (2008)
BindingDB Entry DOI: 10.7270/Q2ZG6VKC
Protein cereblon/Serine/threonine-protein kinase TBK1
(Homo sapiens (Human))
BDBM276923
(US10072001, Example 214 | US10259811, Example 214)
Show SMILES Cc1nc(-c2ccc(OC3CCOCC3)c(c2)C#N)c2nc([nH]c2n1)-c1ccc(cc1)N1CCOCC1
Show InChI InChI=1S/C28H28N6O3/c1-18-30-25(20-4-7-24(21(16-20)17-29)37-23-8-12-35-13-9-23)26-28(31-18)33-27(32-26)19-2-5-22(6-3-19)34-10-14-36-15-11-34/h2-7,16,23H,8-15H2,1H3,(H,30,31,32,33)
US Patent
n/an/a>1.00E+3n/an/an/an/a7.0n/a
Gilead Sciences, Inc.
US Patent
Assay Description
Enzymatic activity of IKKε and TBK1 was measured using a homogeneous time resolved fluorescence resonance energy transfer (TR-FRET) assay that m...
US Patent US10072001 (2018)
BindingDB Entry DOI: 10.7270/Q27H1MMV
Inhibitor of nuclear factor kappa-B kinase subunit epsilon
(Homo sapiens (Human))
BDBM276923
(US10072001, Example 214 | US10259811, Example 214)
Show SMILES Cc1nc(-c2ccc(OC3CCOCC3)c(c2)C#N)c2nc([nH]c2n1)-c1ccc(cc1)N1CCOCC1
Show InChI InChI=1S/C28H28N6O3/c1-18-30-25(20-4-7-24(21(16-20)17-29)37-23-8-12-35-13-9-23)26-28(31-18)33-27(32-26)19-2-5-22(6-3-19)34-10-14-36-15-11-34/h2-7,16,23H,8-15H2,1H3,(H,30,31,32,33)
Reactome pathway
US Patent
n/an/a>1.00E+3n/an/an/an/an/an/a
University of Tokyo
Assay Description
Enzymatic activity of IKKε and TBK1 was measured using a homogeneous time resolved fluorescence resonance energy transfer (TR-FRET) assay that m...
Bioorg Med Chem 16: 4272-85 (2008)
BindingDB Entry DOI: 10.7270/Q2ZG6VKC
Inhibitor of nuclear factor kappa-B kinase subunit epsilon
(Homo sapiens (Human))
BDBM276923
(US10072001, Example 214 | US10259811, Example 214)
Show SMILES Cc1nc(-c2ccc(OC3CCOCC3)c(c2)C#N)c2nc([nH]c2n1)-c1ccc(cc1)N1CCOCC1
Show InChI InChI=1S/C28H28N6O3/c1-18-30-25(20-4-7-24(21(16-20)17-29)37-23-8-12-35-13-9-23)26-28(31-18)33-27(32-26)19-2-5-22(6-3-19)34-10-14-36-15-11-34/h2-7,16,23H,8-15H2,1H3,(H,30,31,32,33)
Reactome pathway
US Patent
n/an/a>1.00E+3n/an/an/an/a7.0n/a
Gilead Sciences, Inc.
US Patent
Assay Description
Enzymatic activity of IKKε and TBK1 was measured using a homogeneous time resolved fluorescence resonance energy transfer (TR-FRET) assay that m...
US Patent US10072001 (2018)
BindingDB Entry DOI: 10.7270/Q27H1MMV