BDBM277704 3-[(1-methyl-1H-indazol-3-yl)amino]pyridine-4-carboxylic acid::US10040779, Example 1::US10336727, Example 1::US9617242, Example 1
SMILES: Cn1nc(Nc2cnccc2C(O)=O)c2ccccc12
InChI Key: InChIKey=CPZUCKVTDNNRCJ-UHFFFAOYSA-N
Data: 9 IC50
Activity Spreadsheet -- Enzyme Inhibition Constant Data from BindingDB
Found 9 hits for monomerid = 277704
Trg + Lig
Ki
nM
ΔG°
kcal/mole
IC50
nM
Kd
nM
EC50/IC50
nM
koff
s-1
kon
M-1s-1
pHTemp
°C
Lysine-specific demethylase 5A
(Homo sapiens (Human))
BDBM277704
(3-[(1-methyl-1H-indazol-3-yl)amino]pyridine-4-carb...)
Show SMILES Cn1nc(Nc2cnccc2C(O)=O)c2ccccc12
Show InChI InChI=1S/C14H12N4O2/c1-18-12-5-3-2-4-10(12)13(17-18)16-11-8-15-7-6-9(11)14(19)20/h2-8H,1H3,(H,16,17)(H,19,20)
Reactome pathway
US Patent
n/an/a<0.100n/an/an/an/an/an/a
Celgene Quanticel Research, Inc.
US Patent
Assay Description
The enzymatic assay of Jarid1A activity is based upon Time Resolved-Fluorescence Resonance Energy Transfer (TR-FRET) detection. The ability of test c...
US Patent US10040779 (2018)
BindingDB Entry DOI: 10.7270/Q26H4KF1
Lysine-specific demethylase 5B
(Homo sapiens (Human))
BDBM277704
(3-[(1-methyl-1H-indazol-3-yl)amino]pyridine-4-carb...)
Show SMILES Cn1nc(Nc2cnccc2C(O)=O)c2ccccc12
Show InChI InChI=1S/C14H12N4O2/c1-18-12-5-3-2-4-10(12)13(17-18)16-11-8-15-7-6-9(11)14(19)20/h2-8H,1H3,(H,16,17)(H,19,20)
US Patent
n/an/a<0.100n/an/an/an/an/an/a
Celgene Quanticel Research, Inc.
US Patent
Assay Description
The ability of test compounds to inhibit the activity of Jarid1B was determined in 384-well plate format under the following reaction conditions: 0.8...
US Patent US10040779 (2018)
BindingDB Entry DOI: 10.7270/Q26H4KF1
Lysine-specific demethylase 4C
(Homo sapiens (Human))
BDBM277704
(3-[(1-methyl-1H-indazol-3-yl)amino]pyridine-4-carb...)
Show SMILES Cn1nc(Nc2cnccc2C(O)=O)c2ccccc12
Show InChI InChI=1S/C14H12N4O2/c1-18-12-5-3-2-4-10(12)13(17-18)16-11-8-15-7-6-9(11)14(19)20/h2-8H,1H3,(H,16,17)(H,19,20)
US Patent
n/an/a<0.100n/an/an/an/an/an/a
Celgene Quanticel Research, Inc.
US Patent
Assay Description
The ability of test compounds to inhibit the activity of JMJD2C was determined in 384-well plate format under the following reaction conditions: 0.3 ...
US Patent US10040779 (2018)
BindingDB Entry DOI: 10.7270/Q26H4KF1
Lysine-specific demethylase 5A
(Homo sapiens (Human))
BDBM277704
(3-[(1-methyl-1H-indazol-3-yl)amino]pyridine-4-carb...)
Show SMILES Cn1nc(Nc2cnccc2C(O)=O)c2ccccc12
Show InChI InChI=1S/C14H12N4O2/c1-18-12-5-3-2-4-10(12)13(17-18)16-11-8-15-7-6-9(11)14(19)20/h2-8H,1H3,(H,16,17)(H,19,20)
Reactome pathway
US Patent
n/an/a<100n/an/an/an/an/an/a
CELGENE QUANTICEL RESEARCH, INC.
US Patent
Assay Description
The enzymatic assay of Jarid1A activity is based upon Time Resolved-Fluorescence Resonance Energy Transfer (TR-FRET) detection. The ability of test c...
US Patent US9617242 (2017)
BindingDB Entry DOI: 10.7270/Q2XK8HM5
Lysine-specific demethylase 4C
(Homo sapiens (Human))
BDBM277704
(3-[(1-methyl-1H-indazol-3-yl)amino]pyridine-4-carb...)
Show SMILES Cn1nc(Nc2cnccc2C(O)=O)c2ccccc12
Show InChI InChI=1S/C14H12N4O2/c1-18-12-5-3-2-4-10(12)13(17-18)16-11-8-15-7-6-9(11)14(19)20/h2-8H,1H3,(H,16,17)(H,19,20)
US Patent
n/an/a<100n/an/an/an/an/an/a
Celgene Quanticel Research Inc
US Patent
Assay Description
The ability of test compounds to inhibit the activity of JMJD2C was determined in 384-well plate format under the following reaction conditions: 0.3 ...
US Patent US10336727 (2019)
BindingDB Entry DOI: 10.7270/Q2571FBT
Lysine-specific demethylase 4C
(Homo sapiens (Human))
BDBM277704
(3-[(1-methyl-1H-indazol-3-yl)amino]pyridine-4-carb...)
Show SMILES Cn1nc(Nc2cnccc2C(O)=O)c2ccccc12
Show InChI InChI=1S/C14H12N4O2/c1-18-12-5-3-2-4-10(12)13(17-18)16-11-8-15-7-6-9(11)14(19)20/h2-8H,1H3,(H,16,17)(H,19,20)
US Patent
n/an/a<100n/an/an/an/an/an/a
CELGENE QUANTICEL RESEARCH, INC.
US Patent
Assay Description
The ability of test compounds to inhibit the activity of JMJD2C was determined in 384-well plate format under the following reaction conditions: 0.3 ...
US Patent US9617242 (2017)
BindingDB Entry DOI: 10.7270/Q2XK8HM5
Lysine-specific demethylase 5A
(Homo sapiens (Human))
BDBM277704
(3-[(1-methyl-1H-indazol-3-yl)amino]pyridine-4-carb...)
Show SMILES Cn1nc(Nc2cnccc2C(O)=O)c2ccccc12
Show InChI InChI=1S/C14H12N4O2/c1-18-12-5-3-2-4-10(12)13(17-18)16-11-8-15-7-6-9(11)14(19)20/h2-8H,1H3,(H,16,17)(H,19,20)
Reactome pathway
US Patent
n/an/a<100n/an/an/an/an/an/a
Celgene Quanticel Research Inc
US Patent
Assay Description
The enzymatic assay of Jarid1A activity is based upon Time Resolved-Fluorescence Resonance Energy Transfer (TR-FRET) detection. The ability of test c...
US Patent US10336727 (2019)
BindingDB Entry DOI: 10.7270/Q2571FBT
Lysine-specific demethylase 5B
(Homo sapiens (Human))
BDBM277704
(3-[(1-methyl-1H-indazol-3-yl)amino]pyridine-4-carb...)
Show SMILES Cn1nc(Nc2cnccc2C(O)=O)c2ccccc12
Show InChI InChI=1S/C14H12N4O2/c1-18-12-5-3-2-4-10(12)13(17-18)16-11-8-15-7-6-9(11)14(19)20/h2-8H,1H3,(H,16,17)(H,19,20)
US Patent
n/an/a<100n/an/an/an/an/an/a
Celgene Quanticel Research Inc
US Patent
Assay Description
The ability of test compounds to inhibit the activity of Jarid1B was determined in 384-well plate format under the following reaction conditions: 0.8...
US Patent US10336727 (2019)
BindingDB Entry DOI: 10.7270/Q2571FBT
Lysine-specific demethylase 5B
(Homo sapiens (Human))
BDBM277704
(3-[(1-methyl-1H-indazol-3-yl)amino]pyridine-4-carb...)
Show SMILES Cn1nc(Nc2cnccc2C(O)=O)c2ccccc12
Show InChI InChI=1S/C14H12N4O2/c1-18-12-5-3-2-4-10(12)13(17-18)16-11-8-15-7-6-9(11)14(19)20/h2-8H,1H3,(H,16,17)(H,19,20)
US Patent
n/an/a<100n/an/an/an/an/an/a
CELGENE QUANTICEL RESEARCH, INC.
US Patent
Assay Description
The ability of test compounds to inhibit the activity of Jarid1B was determined in 384-well plate format under the following reaction conditions: 0.8...
US Patent US9617242 (2017)
BindingDB Entry DOI: 10.7270/Q2XK8HM5