BDBM277724 3-{[5-fluoro-1-(tetrahydrofuran-2-ylmethyl)-1H-indazol-3-yl]amino}pyridine-4-carboxylic acid::US10040779, Example 21::US10336727, Example 21::US9617242, Example 21
SMILES: OC(=O)c1ccncc1Nc1nn(CC2CCCO2)c2ccc(F)cc12
InChI Key: InChIKey=ZXVMZDZMKAVKLI-UHFFFAOYSA-N
Data: 9 IC50
Activity Spreadsheet -- Enzyme Inhibition Constant Data from BindingDB
Found 9 hits for monomerid = 277724
Trg + Lig
Ki
nM
ΔG°
kcal/mole
IC50
nM
Kd
nM
EC50/IC50
nM
koff
s-1
kon
M-1s-1
pHTemp
°C
Lysine-specific demethylase 5A
(Homo sapiens (Human))
BDBM277724
(3-{[5-fluoro-1-(tetrahydrofuran-2-ylmethyl)-1H-ind...)
Show SMILES OC(=O)c1ccncc1Nc1nn(CC2CCCO2)c2ccc(F)cc12
Show InChI InChI=1S/C18H17FN4O3/c19-11-3-4-16-14(8-11)17(22-23(16)10-12-2-1-7-26-12)21-15-9-20-6-5-13(15)18(24)25/h3-6,8-9,12H,1-2,7,10H2,(H,21,22)(H,24,25)
Reactome pathway
US Patent
n/an/a<0.100n/an/an/an/an/an/a
Celgene Quanticel Research, Inc.
US Patent
Assay Description
The enzymatic assay of Jarid1A activity is based upon Time Resolved-Fluorescence Resonance Energy Transfer (TR-FRET) detection. The ability of test c...
US Patent US10040779 (2018)
BindingDB Entry DOI: 10.7270/Q26H4KF1
Lysine-specific demethylase 5B
(Homo sapiens (Human))
BDBM277724
(3-{[5-fluoro-1-(tetrahydrofuran-2-ylmethyl)-1H-ind...)
Show SMILES OC(=O)c1ccncc1Nc1nn(CC2CCCO2)c2ccc(F)cc12
Show InChI InChI=1S/C18H17FN4O3/c19-11-3-4-16-14(8-11)17(22-23(16)10-12-2-1-7-26-12)21-15-9-20-6-5-13(15)18(24)25/h3-6,8-9,12H,1-2,7,10H2,(H,21,22)(H,24,25)
US Patent
n/an/a<0.100n/an/an/an/an/an/a
Celgene Quanticel Research, Inc.
US Patent
Assay Description
The ability of test compounds to inhibit the activity of Jarid1B was determined in 384-well plate format under the following reaction conditions: 0.8...
US Patent US10040779 (2018)
BindingDB Entry DOI: 10.7270/Q26H4KF1
Lysine-specific demethylase 4C
(Homo sapiens (Human))
BDBM277724
(3-{[5-fluoro-1-(tetrahydrofuran-2-ylmethyl)-1H-ind...)
Show SMILES OC(=O)c1ccncc1Nc1nn(CC2CCCO2)c2ccc(F)cc12
Show InChI InChI=1S/C18H17FN4O3/c19-11-3-4-16-14(8-11)17(22-23(16)10-12-2-1-7-26-12)21-15-9-20-6-5-13(15)18(24)25/h3-6,8-9,12H,1-2,7,10H2,(H,21,22)(H,24,25)
US Patent
n/an/a 0.550n/an/an/an/an/an/a
Celgene Quanticel Research, Inc.
US Patent
Assay Description
The ability of test compounds to inhibit the activity of JMJD2C was determined in 384-well plate format under the following reaction conditions: 0.3 ...
US Patent US10040779 (2018)
BindingDB Entry DOI: 10.7270/Q26H4KF1
Lysine-specific demethylase 5A
(Homo sapiens (Human))
BDBM277724
(3-{[5-fluoro-1-(tetrahydrofuran-2-ylmethyl)-1H-ind...)
Show SMILES OC(=O)c1ccncc1Nc1nn(CC2CCCO2)c2ccc(F)cc12
Show InChI InChI=1S/C18H17FN4O3/c19-11-3-4-16-14(8-11)17(22-23(16)10-12-2-1-7-26-12)21-15-9-20-6-5-13(15)18(24)25/h3-6,8-9,12H,1-2,7,10H2,(H,21,22)(H,24,25)
Reactome pathway
US Patent
n/an/a<100n/an/an/an/an/an/a
CELGENE QUANTICEL RESEARCH, INC.
US Patent
Assay Description
The enzymatic assay of Jarid1A activity is based upon Time Resolved-Fluorescence Resonance Energy Transfer (TR-FRET) detection. The ability of test c...
US Patent US9617242 (2017)
BindingDB Entry DOI: 10.7270/Q2XK8HM5
Lysine-specific demethylase 4C
(Homo sapiens (Human))
BDBM277724
(3-{[5-fluoro-1-(tetrahydrofuran-2-ylmethyl)-1H-ind...)
Show SMILES OC(=O)c1ccncc1Nc1nn(CC2CCCO2)c2ccc(F)cc12
Show InChI InChI=1S/C18H17FN4O3/c19-11-3-4-16-14(8-11)17(22-23(16)10-12-2-1-7-26-12)21-15-9-20-6-5-13(15)18(24)25/h3-6,8-9,12H,1-2,7,10H2,(H,21,22)(H,24,25)
US Patent
n/an/a 550n/an/an/an/an/an/a
Celgene Quanticel Research Inc
US Patent
Assay Description
The ability of test compounds to inhibit the activity of JMJD2C was determined in 384-well plate format under the following reaction conditions: 0.3 ...
US Patent US10336727 (2019)
BindingDB Entry DOI: 10.7270/Q2571FBT
Lysine-specific demethylase 4C
(Homo sapiens (Human))
BDBM277724
(3-{[5-fluoro-1-(tetrahydrofuran-2-ylmethyl)-1H-ind...)
Show SMILES OC(=O)c1ccncc1Nc1nn(CC2CCCO2)c2ccc(F)cc12
Show InChI InChI=1S/C18H17FN4O3/c19-11-3-4-16-14(8-11)17(22-23(16)10-12-2-1-7-26-12)21-15-9-20-6-5-13(15)18(24)25/h3-6,8-9,12H,1-2,7,10H2,(H,21,22)(H,24,25)
US Patent
n/an/a 550n/an/an/an/an/an/a
CELGENE QUANTICEL RESEARCH, INC.
US Patent
Assay Description
The ability of test compounds to inhibit the activity of JMJD2C was determined in 384-well plate format under the following reaction conditions: 0.3 ...
US Patent US9617242 (2017)
BindingDB Entry DOI: 10.7270/Q2XK8HM5
Lysine-specific demethylase 5A
(Homo sapiens (Human))
BDBM277724
(3-{[5-fluoro-1-(tetrahydrofuran-2-ylmethyl)-1H-ind...)
Show SMILES OC(=O)c1ccncc1Nc1nn(CC2CCCO2)c2ccc(F)cc12
Show InChI InChI=1S/C18H17FN4O3/c19-11-3-4-16-14(8-11)17(22-23(16)10-12-2-1-7-26-12)21-15-9-20-6-5-13(15)18(24)25/h3-6,8-9,12H,1-2,7,10H2,(H,21,22)(H,24,25)
Reactome pathway
US Patent
n/an/a<100n/an/an/an/an/an/a
Celgene Quanticel Research Inc
US Patent
Assay Description
The enzymatic assay of Jarid1A activity is based upon Time Resolved-Fluorescence Resonance Energy Transfer (TR-FRET) detection. The ability of test c...
US Patent US10336727 (2019)
BindingDB Entry DOI: 10.7270/Q2571FBT
Lysine-specific demethylase 5B
(Homo sapiens (Human))
BDBM277724
(3-{[5-fluoro-1-(tetrahydrofuran-2-ylmethyl)-1H-ind...)
Show SMILES OC(=O)c1ccncc1Nc1nn(CC2CCCO2)c2ccc(F)cc12
Show InChI InChI=1S/C18H17FN4O3/c19-11-3-4-16-14(8-11)17(22-23(16)10-12-2-1-7-26-12)21-15-9-20-6-5-13(15)18(24)25/h3-6,8-9,12H,1-2,7,10H2,(H,21,22)(H,24,25)
US Patent
n/an/a<100n/an/an/an/an/an/a
Celgene Quanticel Research Inc
US Patent
Assay Description
The ability of test compounds to inhibit the activity of Jarid1B was determined in 384-well plate format under the following reaction conditions: 0.8...
US Patent US10336727 (2019)
BindingDB Entry DOI: 10.7270/Q2571FBT
Lysine-specific demethylase 5B
(Homo sapiens (Human))
BDBM277724
(3-{[5-fluoro-1-(tetrahydrofuran-2-ylmethyl)-1H-ind...)
Show SMILES OC(=O)c1ccncc1Nc1nn(CC2CCCO2)c2ccc(F)cc12
Show InChI InChI=1S/C18H17FN4O3/c19-11-3-4-16-14(8-11)17(22-23(16)10-12-2-1-7-26-12)21-15-9-20-6-5-13(15)18(24)25/h3-6,8-9,12H,1-2,7,10H2,(H,21,22)(H,24,25)
US Patent
n/an/a<100n/an/an/an/an/an/a
CELGENE QUANTICEL RESEARCH, INC.
US Patent
Assay Description
The ability of test compounds to inhibit the activity of Jarid1B was determined in 384-well plate format under the following reaction conditions: 0.8...
US Patent US9617242 (2017)
BindingDB Entry DOI: 10.7270/Q2XK8HM5