BDBM277725 3-({1-[2-(dimethylamino)pentyl]-5-fluoro-1H-indazol-3-yl}amino)pyridine-4-carboxylic acid::US10040779, Example 22::US10336727, Example 22::US9617242, Example 22
SMILES: CN(C)CCCCCn1nc(Nc2cnccc2C(O)=O)c2cc(F)ccc12
InChI Key: InChIKey=MQQZOGVKWBMWFV-UHFFFAOYSA-N
Data: 9 IC50
Activity Spreadsheet -- Enzyme Inhibition Constant Data from BindingDB
Found 9 hits for monomerid = 277725
Trg + Lig
Ki
nM
ΔG°
kcal/mole
IC50
nM
Kd
nM
EC50/IC50
nM
koff
s-1
kon
M-1s-1
pHTemp
°C
Lysine-specific demethylase 5A
(Homo sapiens (Human))
BDBM277725
(3-({1-[2-(dimethylamino)pentyl]-5-fluoro-1H-indazo...)
Show SMILES CN(C)CCCCCn1nc(Nc2cnccc2C(O)=O)c2cc(F)ccc12
Show InChI InChI=1S/C20H24FN5O2/c1-25(2)10-4-3-5-11-26-18-7-6-14(21)12-16(18)19(24-26)23-17-13-22-9-8-15(17)20(27)28/h6-9,12-13H,3-5,10-11H2,1-2H3,(H,23,24)(H,27,28)
Reactome pathway
US Patent
n/an/a<0.100n/an/an/an/an/an/a
Celgene Quanticel Research, Inc.
US Patent
Assay Description
The enzymatic assay of Jarid1A activity is based upon Time Resolved-Fluorescence Resonance Energy Transfer (TR-FRET) detection. The ability of test c...
US Patent US10040779 (2018)
BindingDB Entry DOI: 10.7270/Q26H4KF1
Lysine-specific demethylase 5B
(Homo sapiens (Human))
BDBM277725
(3-({1-[2-(dimethylamino)pentyl]-5-fluoro-1H-indazo...)
Show SMILES CN(C)CCCCCn1nc(Nc2cnccc2C(O)=O)c2cc(F)ccc12
Show InChI InChI=1S/C20H24FN5O2/c1-25(2)10-4-3-5-11-26-18-7-6-14(21)12-16(18)19(24-26)23-17-13-22-9-8-15(17)20(27)28/h6-9,12-13H,3-5,10-11H2,1-2H3,(H,23,24)(H,27,28)
US Patent
n/an/a<0.100n/an/an/an/an/an/a
Celgene Quanticel Research, Inc.
US Patent
Assay Description
The ability of test compounds to inhibit the activity of Jarid1B was determined in 384-well plate format under the following reaction conditions: 0.8...
US Patent US10040779 (2018)
BindingDB Entry DOI: 10.7270/Q26H4KF1
Lysine-specific demethylase 4C
(Homo sapiens (Human))
BDBM277725
(3-({1-[2-(dimethylamino)pentyl]-5-fluoro-1H-indazo...)
Show SMILES CN(C)CCCCCn1nc(Nc2cnccc2C(O)=O)c2cc(F)ccc12
Show InChI InChI=1S/C20H24FN5O2/c1-25(2)10-4-3-5-11-26-18-7-6-14(21)12-16(18)19(24-26)23-17-13-22-9-8-15(17)20(27)28/h6-9,12-13H,3-5,10-11H2,1-2H3,(H,23,24)(H,27,28)
US Patent
n/an/a 0.550n/an/an/an/an/an/a
Celgene Quanticel Research, Inc.
US Patent
Assay Description
The ability of test compounds to inhibit the activity of JMJD2C was determined in 384-well plate format under the following reaction conditions: 0.3 ...
US Patent US10040779 (2018)
BindingDB Entry DOI: 10.7270/Q26H4KF1
Lysine-specific demethylase 5A
(Homo sapiens (Human))
BDBM277725
(3-({1-[2-(dimethylamino)pentyl]-5-fluoro-1H-indazo...)
Show SMILES CN(C)CCCCCn1nc(Nc2cnccc2C(O)=O)c2cc(F)ccc12
Show InChI InChI=1S/C20H24FN5O2/c1-25(2)10-4-3-5-11-26-18-7-6-14(21)12-16(18)19(24-26)23-17-13-22-9-8-15(17)20(27)28/h6-9,12-13H,3-5,10-11H2,1-2H3,(H,23,24)(H,27,28)
Reactome pathway
US Patent
n/an/a<100n/an/an/an/an/an/a
CELGENE QUANTICEL RESEARCH, INC.
US Patent
Assay Description
The enzymatic assay of Jarid1A activity is based upon Time Resolved-Fluorescence Resonance Energy Transfer (TR-FRET) detection. The ability of test c...
US Patent US9617242 (2017)
BindingDB Entry DOI: 10.7270/Q2XK8HM5
Lysine-specific demethylase 4C
(Homo sapiens (Human))
BDBM277725
(3-({1-[2-(dimethylamino)pentyl]-5-fluoro-1H-indazo...)
Show SMILES CN(C)CCCCCn1nc(Nc2cnccc2C(O)=O)c2cc(F)ccc12
Show InChI InChI=1S/C20H24FN5O2/c1-25(2)10-4-3-5-11-26-18-7-6-14(21)12-16(18)19(24-26)23-17-13-22-9-8-15(17)20(27)28/h6-9,12-13H,3-5,10-11H2,1-2H3,(H,23,24)(H,27,28)
US Patent
n/an/a 550n/an/an/an/an/an/a
Celgene Quanticel Research Inc
US Patent
Assay Description
The ability of test compounds to inhibit the activity of JMJD2C was determined in 384-well plate format under the following reaction conditions: 0.3 ...
US Patent US10336727 (2019)
BindingDB Entry DOI: 10.7270/Q2571FBT
Lysine-specific demethylase 4C
(Homo sapiens (Human))
BDBM277725
(3-({1-[2-(dimethylamino)pentyl]-5-fluoro-1H-indazo...)
Show SMILES CN(C)CCCCCn1nc(Nc2cnccc2C(O)=O)c2cc(F)ccc12
Show InChI InChI=1S/C20H24FN5O2/c1-25(2)10-4-3-5-11-26-18-7-6-14(21)12-16(18)19(24-26)23-17-13-22-9-8-15(17)20(27)28/h6-9,12-13H,3-5,10-11H2,1-2H3,(H,23,24)(H,27,28)
US Patent
n/an/a 550n/an/an/an/an/an/a
CELGENE QUANTICEL RESEARCH, INC.
US Patent
Assay Description
The ability of test compounds to inhibit the activity of JMJD2C was determined in 384-well plate format under the following reaction conditions: 0.3 ...
US Patent US9617242 (2017)
BindingDB Entry DOI: 10.7270/Q2XK8HM5
Lysine-specific demethylase 5A
(Homo sapiens (Human))
BDBM277725
(3-({1-[2-(dimethylamino)pentyl]-5-fluoro-1H-indazo...)
Show SMILES CN(C)CCCCCn1nc(Nc2cnccc2C(O)=O)c2cc(F)ccc12
Show InChI InChI=1S/C20H24FN5O2/c1-25(2)10-4-3-5-11-26-18-7-6-14(21)12-16(18)19(24-26)23-17-13-22-9-8-15(17)20(27)28/h6-9,12-13H,3-5,10-11H2,1-2H3,(H,23,24)(H,27,28)
Reactome pathway
US Patent
n/an/a<100n/an/an/an/an/an/a
Celgene Quanticel Research Inc
US Patent
Assay Description
The enzymatic assay of Jarid1A activity is based upon Time Resolved-Fluorescence Resonance Energy Transfer (TR-FRET) detection. The ability of test c...
US Patent US10336727 (2019)
BindingDB Entry DOI: 10.7270/Q2571FBT
Lysine-specific demethylase 5B
(Homo sapiens (Human))
BDBM277725
(3-({1-[2-(dimethylamino)pentyl]-5-fluoro-1H-indazo...)
Show SMILES CN(C)CCCCCn1nc(Nc2cnccc2C(O)=O)c2cc(F)ccc12
Show InChI InChI=1S/C20H24FN5O2/c1-25(2)10-4-3-5-11-26-18-7-6-14(21)12-16(18)19(24-26)23-17-13-22-9-8-15(17)20(27)28/h6-9,12-13H,3-5,10-11H2,1-2H3,(H,23,24)(H,27,28)
US Patent
n/an/a<100n/an/an/an/an/an/a
Celgene Quanticel Research Inc
US Patent
Assay Description
The ability of test compounds to inhibit the activity of Jarid1B was determined in 384-well plate format under the following reaction conditions: 0.8...
US Patent US10336727 (2019)
BindingDB Entry DOI: 10.7270/Q2571FBT
Lysine-specific demethylase 5B
(Homo sapiens (Human))
BDBM277725
(3-({1-[2-(dimethylamino)pentyl]-5-fluoro-1H-indazo...)
Show SMILES CN(C)CCCCCn1nc(Nc2cnccc2C(O)=O)c2cc(F)ccc12
Show InChI InChI=1S/C20H24FN5O2/c1-25(2)10-4-3-5-11-26-18-7-6-14(21)12-16(18)19(24-26)23-17-13-22-9-8-15(17)20(27)28/h6-9,12-13H,3-5,10-11H2,1-2H3,(H,23,24)(H,27,28)
US Patent
n/an/a<100n/an/an/an/an/an/a
CELGENE QUANTICEL RESEARCH, INC.
US Patent
Assay Description
The ability of test compounds to inhibit the activity of Jarid1B was determined in 384-well plate format under the following reaction conditions: 0.8...
US Patent US9617242 (2017)
BindingDB Entry DOI: 10.7270/Q2XK8HM5