BDBM277727 3-[(1-benzyl-5-fluoro-1H-indazol-3-yl)amino]pyridine-4-carboxylic acid::US10040779, Example 24::US10336727, Example 24::US9617242, Example 24
SMILES: OC(=O)c1ccncc1Nc1nn(Cc2ccccc2)c2ccc(F)cc12
InChI Key: InChIKey=XPBGYJQDZOLQAL-UHFFFAOYSA-N
Data: 9 IC50
Activity Spreadsheet -- Enzyme Inhibition Constant Data from BindingDB
Found 9 hits for monomerid = 277727
Trg + Lig
Ki
nM
ΔG°
kcal/mole
IC50
nM
Kd
nM
EC50/IC50
nM
koff
s-1
kon
M-1s-1
pHTemp
°C
Lysine-specific demethylase 5A
(Homo sapiens (Human))
BDBM277727
(3-[(1-benzyl-5-fluoro-1H-indazol-3-yl)amino]pyridi...)
Show SMILES OC(=O)c1ccncc1Nc1nn(Cc2ccccc2)c2ccc(F)cc12
Show InChI InChI=1S/C20H15FN4O2/c21-14-6-7-18-16(10-14)19(23-17-11-22-9-8-15(17)20(26)27)24-25(18)12-13-4-2-1-3-5-13/h1-11H,12H2,(H,23,24)(H,26,27)
Reactome pathway
US Patent
n/an/a<0.100n/an/an/an/an/an/a
Celgene Quanticel Research, Inc.
US Patent
Assay Description
The enzymatic assay of Jarid1A activity is based upon Time Resolved-Fluorescence Resonance Energy Transfer (TR-FRET) detection. The ability of test c...
US Patent US10040779 (2018)
BindingDB Entry DOI: 10.7270/Q26H4KF1
Lysine-specific demethylase 5B
(Homo sapiens (Human))
BDBM277727
(3-[(1-benzyl-5-fluoro-1H-indazol-3-yl)amino]pyridi...)
Show SMILES OC(=O)c1ccncc1Nc1nn(Cc2ccccc2)c2ccc(F)cc12
Show InChI InChI=1S/C20H15FN4O2/c21-14-6-7-18-16(10-14)19(23-17-11-22-9-8-15(17)20(26)27)24-25(18)12-13-4-2-1-3-5-13/h1-11H,12H2,(H,23,24)(H,26,27)
US Patent
n/an/a<0.100n/an/an/an/an/an/a
Celgene Quanticel Research, Inc.
US Patent
Assay Description
The ability of test compounds to inhibit the activity of Jarid1B was determined in 384-well plate format under the following reaction conditions: 0.8...
US Patent US10040779 (2018)
BindingDB Entry DOI: 10.7270/Q26H4KF1
Lysine-specific demethylase 4C
(Homo sapiens (Human))
BDBM277727
(3-[(1-benzyl-5-fluoro-1H-indazol-3-yl)amino]pyridi...)
Show SMILES OC(=O)c1ccncc1Nc1nn(Cc2ccccc2)c2ccc(F)cc12
Show InChI InChI=1S/C20H15FN4O2/c21-14-6-7-18-16(10-14)19(23-17-11-22-9-8-15(17)20(26)27)24-25(18)12-13-4-2-1-3-5-13/h1-11H,12H2,(H,23,24)(H,26,27)
US Patent
n/an/a 0.550n/an/an/an/an/an/a
Celgene Quanticel Research, Inc.
US Patent
Assay Description
The ability of test compounds to inhibit the activity of JMJD2C was determined in 384-well plate format under the following reaction conditions: 0.3 ...
US Patent US10040779 (2018)
BindingDB Entry DOI: 10.7270/Q26H4KF1
Lysine-specific demethylase 5A
(Homo sapiens (Human))
BDBM277727
(3-[(1-benzyl-5-fluoro-1H-indazol-3-yl)amino]pyridi...)
Show SMILES OC(=O)c1ccncc1Nc1nn(Cc2ccccc2)c2ccc(F)cc12
Show InChI InChI=1S/C20H15FN4O2/c21-14-6-7-18-16(10-14)19(23-17-11-22-9-8-15(17)20(26)27)24-25(18)12-13-4-2-1-3-5-13/h1-11H,12H2,(H,23,24)(H,26,27)
Reactome pathway
US Patent
n/an/a<100n/an/an/an/an/an/a
CELGENE QUANTICEL RESEARCH, INC.
US Patent
Assay Description
The enzymatic assay of Jarid1A activity is based upon Time Resolved-Fluorescence Resonance Energy Transfer (TR-FRET) detection. The ability of test c...
US Patent US9617242 (2017)
BindingDB Entry DOI: 10.7270/Q2XK8HM5
Lysine-specific demethylase 4C
(Homo sapiens (Human))
BDBM277727
(3-[(1-benzyl-5-fluoro-1H-indazol-3-yl)amino]pyridi...)
Show SMILES OC(=O)c1ccncc1Nc1nn(Cc2ccccc2)c2ccc(F)cc12
Show InChI InChI=1S/C20H15FN4O2/c21-14-6-7-18-16(10-14)19(23-17-11-22-9-8-15(17)20(26)27)24-25(18)12-13-4-2-1-3-5-13/h1-11H,12H2,(H,23,24)(H,26,27)
US Patent
n/an/a 550n/an/an/an/an/an/a
Celgene Quanticel Research Inc
US Patent
Assay Description
The ability of test compounds to inhibit the activity of JMJD2C was determined in 384-well plate format under the following reaction conditions: 0.3 ...
US Patent US10336727 (2019)
BindingDB Entry DOI: 10.7270/Q2571FBT
Lysine-specific demethylase 4C
(Homo sapiens (Human))
BDBM277727
(3-[(1-benzyl-5-fluoro-1H-indazol-3-yl)amino]pyridi...)
Show SMILES OC(=O)c1ccncc1Nc1nn(Cc2ccccc2)c2ccc(F)cc12
Show InChI InChI=1S/C20H15FN4O2/c21-14-6-7-18-16(10-14)19(23-17-11-22-9-8-15(17)20(26)27)24-25(18)12-13-4-2-1-3-5-13/h1-11H,12H2,(H,23,24)(H,26,27)
US Patent
n/an/a 550n/an/an/an/an/an/a
CELGENE QUANTICEL RESEARCH, INC.
US Patent
Assay Description
The ability of test compounds to inhibit the activity of JMJD2C was determined in 384-well plate format under the following reaction conditions: 0.3 ...
US Patent US9617242 (2017)
BindingDB Entry DOI: 10.7270/Q2XK8HM5
Lysine-specific demethylase 5A
(Homo sapiens (Human))
BDBM277727
(3-[(1-benzyl-5-fluoro-1H-indazol-3-yl)amino]pyridi...)
Show SMILES OC(=O)c1ccncc1Nc1nn(Cc2ccccc2)c2ccc(F)cc12
Show InChI InChI=1S/C20H15FN4O2/c21-14-6-7-18-16(10-14)19(23-17-11-22-9-8-15(17)20(26)27)24-25(18)12-13-4-2-1-3-5-13/h1-11H,12H2,(H,23,24)(H,26,27)
Reactome pathway
US Patent
n/an/a<100n/an/an/an/an/an/a
Celgene Quanticel Research Inc
US Patent
Assay Description
The enzymatic assay of Jarid1A activity is based upon Time Resolved-Fluorescence Resonance Energy Transfer (TR-FRET) detection. The ability of test c...
US Patent US10336727 (2019)
BindingDB Entry DOI: 10.7270/Q2571FBT
Lysine-specific demethylase 5B
(Homo sapiens (Human))
BDBM277727
(3-[(1-benzyl-5-fluoro-1H-indazol-3-yl)amino]pyridi...)
Show SMILES OC(=O)c1ccncc1Nc1nn(Cc2ccccc2)c2ccc(F)cc12
Show InChI InChI=1S/C20H15FN4O2/c21-14-6-7-18-16(10-14)19(23-17-11-22-9-8-15(17)20(26)27)24-25(18)12-13-4-2-1-3-5-13/h1-11H,12H2,(H,23,24)(H,26,27)
US Patent
n/an/a<100n/an/an/an/an/an/a
Celgene Quanticel Research Inc
US Patent
Assay Description
The ability of test compounds to inhibit the activity of Jarid1B was determined in 384-well plate format under the following reaction conditions: 0.8...
US Patent US10336727 (2019)
BindingDB Entry DOI: 10.7270/Q2571FBT
Lysine-specific demethylase 5B
(Homo sapiens (Human))
BDBM277727
(3-[(1-benzyl-5-fluoro-1H-indazol-3-yl)amino]pyridi...)
Show SMILES OC(=O)c1ccncc1Nc1nn(Cc2ccccc2)c2ccc(F)cc12
Show InChI InChI=1S/C20H15FN4O2/c21-14-6-7-18-16(10-14)19(23-17-11-22-9-8-15(17)20(26)27)24-25(18)12-13-4-2-1-3-5-13/h1-11H,12H2,(H,23,24)(H,26,27)
US Patent
n/an/a<100n/an/an/an/an/an/a
CELGENE QUANTICEL RESEARCH, INC.
US Patent
Assay Description
The ability of test compounds to inhibit the activity of Jarid1B was determined in 384-well plate format under the following reaction conditions: 0.8...
US Patent US9617242 (2017)
BindingDB Entry DOI: 10.7270/Q2XK8HM5